Patch set 66090–66093 v5

net/virtio: add link speed devarg

Submitter
Ivan Dyukov
Applied on
dpdk-next-virtio (545cd4f422ecc60e0470d0576deb29291f0ff9b9)
Date submitted
Feb. 27, 2020, 2:16 p.m.

Test Results Build Error

Configuration done using x86_64-native-linuxapp-gcc
== Build lib
== Build lib/librte_kvargs
== Build lib/librte_eal
/home-local/jenkins-local/jenkins-agent/workspace/Apply-Custom-Patch-Set/dpdk/mk/toolchain/gcc/rte.toolchain-compat.mk:30: AVX512 support disabled because of binutils 2.30. See Bug 97
== Build lib/librte_eal/common
== Build lib/librte_eal/linux
== Build lib/librte_eal/linux/eal
== Build lib/librte_pci
== Build lib/librte_ring
== Build lib/librte_stack
== Build lib/librte_mempool
== Build lib/librte_mbuf
== Build lib/librte_timer
== Build lib/librte_cfgfile
== Build lib/librte_net
== Build lib/librte_cmdline
== Build lib/librte_meter
== Build lib/librte_ethdev
== Build lib/librte_bbdev
== Build lib/librte_cryptodev
== Build lib/librte_security
== Build lib/librte_compressdev
== Build lib/librte_hash
== Build lib/librte_eventdev
== Build lib/librte_rawdev
== Build lib/librte_vhost
== Build lib/librte_efd
== Build lib/librte_rib
== Build lib/librte_fib
== Build lib/librte_lpm
== Build lib/librte_acl
== Build lib/librte_member
== Build lib/librte_ip_frag
== Build lib/librte_gro
== Build lib/librte_jobstats
== Build lib/librte_metrics
== Build lib/librte_bitratestats
== Build lib/librte_latencystats
== Build lib/librte_power
== Build lib/librte_sched
== Build lib/librte_kni
== Build lib/librte_port
== Build lib/librte_table
== Build lib/librte_flow_classify
== Build lib/librte_distributor
== Build lib/librte_pipeline
== Build lib/librte_reorder
== Build lib/librte_pdump
== Build lib/librte_gso
== Build lib/librte_bpf
== Build lib/librte_ipsec
== Build lib/librte_rcu
== Build buildtools
== Build buildtools/pmdinfogen
== Build kernel
== Build kernel/linux
== Build drivers
== Build drivers/common
== Build drivers/common/cpt
== Build drivers/common/octeontx
== Build drivers/common/octeontx2
== Build drivers/common/dpaax
== Build drivers/common/iavf
== Build drivers/bus
== Build drivers/bus/dpaa
== Build drivers/bus/fslmc
== Build drivers/bus/ifpga
== Build drivers/bus/pci
== Build drivers/bus/vdev
== Build drivers/bus/vmbus
== Build drivers/mempool
== Build drivers/mempool/bucket
== Build drivers/mempool/dpaa
== Build drivers/mempool/dpaa2
== Build drivers/mempool/ring
== Build drivers/mempool/stack
== Build drivers/mempool/octeontx
== Build drivers/mempool/octeontx2
== Build drivers/net
== Build drivers/net/af_packet
== Build drivers/net/ark
== Build drivers/net/atlantic
== Build drivers/net/avp
== Build drivers/net/axgbe
== Build drivers/net/bonding
== Build drivers/net/cxgbe
== Build drivers/net/dpaa
== Build drivers/net/dpaa2
== Build drivers/net/e1000
== Build drivers/net/ena
== Build drivers/net/enetc
== Build drivers/net/enic
== Build drivers/net/failsafe
== Build drivers/net/fm10k
== Build drivers/net/hinic
== Build drivers/net/hns3
== Build drivers/net/i40e
== Build drivers/net/iavf
== Build drivers/net/ice
== Build drivers/net/ionic
== Build drivers/net/ixgbe
== Build drivers/net/liquidio
== Build drivers/net/memif
== Build drivers/net/netvsc
== Build drivers/net/nfp
== Build drivers/net/bnxt
== Build drivers/net/null
== Build drivers/net/octeontx
== Build drivers/net/octeontx2
== Build drivers/net/qede
== Build drivers/net/ring
== Build drivers/net/sfc
== Build drivers/net/tap
== Build drivers/net/thunderx
== Build drivers/net/vdev_netvsc
== Build drivers/net/virtio
  CC virtio_ethdev.o
/home-local/jenkins-local/jenkins-agent/workspace/Apply-Custom-Patch-Set/dpdk/drivers/net/virtio/virtio_ethdev.c: In function ‘eth_virtio_pci_probe’:
/home-local/jenkins-local/jenkins-agent/workspace/Apply-Custom-Patch-Set/dpdk/drivers/net/virtio/virtio_ethdev.c:2077:3: error: implicit declaration of function ‘PMD_INIG_LOG’; did you mean ‘PMD_INIT_LOG’? [-Werror=implicit-function-declaration]
   PMD_INIG_LOG(ERR, "devargs parsing is failed");
   ^~~~~~~~~~~~
   PMD_INIT_LOG
/home-local/jenkins-local/jenkins-agent/workspace/Apply-Custom-Patch-Set/dpdk/drivers/net/virtio/virtio_ethdev.c:2077:3: error: nested extern declaration of ‘PMD_INIG_LOG’ [-Werror=nested-externs]
/home-local/jenkins-local/jenkins-agent/workspace/Apply-Custom-Patch-Set/dpdk/drivers/net/virtio/virtio_ethdev.c:2077:16: error: ‘ERR’ undeclared (first use in this function)
   PMD_INIG_LOG(ERR, "devargs parsing is failed");
                ^~~
/home-local/jenkins-local/jenkins-agent/workspace/Apply-Custom-Patch-Set/dpdk/drivers/net/virtio/virtio_ethdev.c:2077:16: note: each undeclared identifier is reported only once for each function it appears in
/home-local/jenkins-local/jenkins-agent/workspace/Apply-Custom-Patch-Set/dpdk/drivers/net/virtio/virtio_ethdev.c: At top level:
cc1: error: unrecognized command line option ‘-Wno-address-of-packed-member’ [-Werror]
cc1: all warnings being treated as errors
/home-local/jenkins-local/jenkins-agent/workspace/Apply-Custom-Patch-Set/dpdk/mk/internal/rte.compile-pre.mk:114: recipe for target 'virtio_ethdev.o' failed
make[6]: *** [virtio_ethdev.o] Error 1
/home-local/jenkins-local/jenkins-agent/workspace/Apply-Custom-Patch-Set/dpdk/mk/rte.subdir.mk:35: recipe for target 'virtio' failed
make[5]: *** [virtio] Error 2
/home-local/jenkins-local/jenkins-agent/workspace/Apply-Custom-Patch-Set/dpdk/mk/rte.subdir.mk:35: recipe for target 'net' failed
make[4]: *** [net] Error 2
/home-local/jenkins-local/jenkins-agent/workspace/Apply-Custom-Patch-Set/dpdk/mk/rte.sdkbuild.mk:46: recipe for target 'drivers' failed
make[3]: *** [drivers] Error 2
/home-local/jenkins-local/jenkins-agent/workspace/Apply-Custom-Patch-Set/dpdk/mk/rte.sdkroot.mk:98: recipe for target 'all' failed
make[2]: *** [all] Error 2
/home-local/jenkins-local/jenkins-agent/workspace/Apply-Custom-Patch-Set/dpdk/mk/rte.sdkinstall.mk:60: recipe for target 'pre_install' failed
make[1]: *** [pre_install] Error 2
/home-local/jenkins-local/jenkins-agent/workspace/Apply-Custom-Patch-Set/dpdk/mk/rte.sdkroot.mk:77: recipe for target 'install' failed
make: *** [install] Error 2