Patch set 61361–61362 v2

[1/2,v2] event/dpaa2: set priority as per the dpcon device

Submitter
Nipun Gupta
Applied on
dpdk (ad4305d0d5ed103cf5217eb120168ff8f285466c)
Date submitted
Oct. 17, 2019, 8:29 a.m.

Test Results Build Error

Configuration done using x86_64-native-linuxapp-gcc
== Build lib
== Build lib/librte_kvargs
== Build lib/librte_eal
/home-local/jenkins-local/jenkins-agent/workspace/Apply-Custom-Patch-Set/dpdk/mk/toolchain/gcc/rte.toolchain-compat.mk:30: AVX512 support disabled because of binutils 2.30. See Bug 97
== Build lib/librte_eal/common
== Build lib/librte_eal/linux
== Build lib/librte_eal/linux/eal
== Build lib/librte_pci
== Build lib/librte_ring
== Build lib/librte_stack
== Build lib/librte_mempool
== Build lib/librte_mbuf
== Build lib/librte_timer
== Build lib/librte_cfgfile
== Build lib/librte_net
== Build lib/librte_cmdline
== Build lib/librte_meter
== Build lib/librte_ethdev
== Build lib/librte_bbdev
== Build lib/librte_cryptodev
== Build lib/librte_security
== Build lib/librte_compressdev
== Build lib/librte_hash
== Build lib/librte_eventdev
== Build lib/librte_rawdev
== Build lib/librte_vhost
== Build lib/librte_efd
== Build lib/librte_lpm
== Build lib/librte_acl
== Build lib/librte_member
== Build lib/librte_ip_frag
== Build lib/librte_gro
== Build lib/librte_jobstats
== Build lib/librte_metrics
== Build lib/librte_bitratestats
== Build lib/librte_latencystats
== Build lib/librte_power
== Build lib/librte_sched
== Build lib/librte_kni
== Build lib/librte_port
== Build lib/librte_table
== Build lib/librte_flow_classify
== Build lib/librte_distributor
== Build lib/librte_pipeline
== Build lib/librte_reorder
== Build lib/librte_pdump
== Build lib/librte_gso
== Build lib/librte_bpf
== Build lib/librte_ipsec
== Build lib/librte_rcu
== Build buildtools
== Build buildtools/pmdinfogen
== Build kernel
== Build kernel/linux
== Build kernel/linux/igb_uio
  Building modules, stage 2.
  MODPOST 1 modules
== Build kernel/linux/kni
  Building modules, stage 2.
  MODPOST 1 modules
== Build drivers
== Build drivers/common
== Build drivers/common/cpt
== Build drivers/common/octeontx
== Build drivers/common/octeontx2
== Build drivers/common/dpaax
== Build drivers/bus
== Build drivers/bus/dpaa
== Build drivers/bus/fslmc
== Build drivers/bus/ifpga
== Build drivers/bus/pci
== Build drivers/bus/vdev
== Build drivers/bus/vmbus
== Build drivers/mempool
== Build drivers/mempool/bucket
== Build drivers/mempool/dpaa
== Build drivers/mempool/dpaa2
== Build drivers/mempool/ring
== Build drivers/mempool/stack
== Build drivers/mempool/octeontx
== Build drivers/mempool/octeontx2
== Build drivers/net
== Build drivers/net/af_packet
== Build drivers/net/ark
== Build drivers/net/atlantic
== Build drivers/net/avp
== Build drivers/net/axgbe
== Build drivers/net/bonding
== Build drivers/net/cxgbe
== Build drivers/net/dpaa
== Build drivers/net/dpaa2
== Build drivers/net/e1000
== Build drivers/net/ena
== Build drivers/net/enetc
== Build drivers/net/enic
== Build drivers/net/failsafe
== Build drivers/net/fm10k
== Build drivers/net/hinic
== Build drivers/net/hns3
== Build drivers/net/i40e
== Build drivers/net/iavf
== Build drivers/net/ice
== Build drivers/net/ipn3ke
== Build drivers/net/ixgbe
== Build drivers/net/liquidio
== Build drivers/net/memif
== Build drivers/net/netvsc
== Build drivers/net/nfp
== Build drivers/net/bnxt
== Build drivers/net/null
== Build drivers/net/octeontx
== Build drivers/net/octeontx2
== Build drivers/net/qede
== Build drivers/net/ring
== Build drivers/net/sfc
== Build drivers/net/tap
== Build drivers/net/thunderx
== Build drivers/net/vdev_netvsc
== Build drivers/net/virtio
== Build drivers/net/vmxnet3
== Build drivers/net/kni
== Build drivers/net/softnic
== Build drivers/net/vhost
== Build drivers/net/ifc
== Build drivers/baseband
== Build drivers/baseband/null
== Build drivers/baseband/turbo_sw
== Build drivers/baseband/fpga_lte_fec
== Build drivers/crypto
== Build drivers/crypto/octeontx
== Build drivers/crypto/scheduler
== Build drivers/crypto/null
== Build drivers/crypto/dpaa2_sec
== Build drivers/crypto/dpaa_sec
== Build drivers/crypto/caam_jr
== Build drivers/crypto/virtio
== Build drivers/crypto/nitrox
== Build drivers/common/qat
== Build drivers/compress
== Build drivers/compress/octeontx
== Build drivers/event
== Build drivers/event/skeleton
== Build drivers/event/sw
== Build drivers/event/dsw
== Build drivers/event/octeontx
== Build drivers/event/octeontx2
== Build drivers/event/dpaa
== Build drivers/event/dpaa2
  CC dpaa2_eventdev.o
/home-local/jenkins-local/jenkins-agent/workspace/Apply-Custom-Patch-Set/dpdk/drivers/event/dpaa2/dpaa2_eventdev.c: In function ‘dpaa2_eventdev_create’:
/home-local/jenkins-local/jenkins-agent/workspace/Apply-Custom-Patch-Set/dpdk/drivers/event/dpaa2/dpaa2_eventdev.c:1102:12: error: ‘struct rte_eventdev’ has no member named ‘txa_enqueue_same_dest’; did you mean ‘txa_enqueue’?
  eventdev->txa_enqueue_same_dest = dpaa2_eventdev_txa_enqueue_same_dest;
            ^~~~~~~~~~~~~~~~~~~~~
            txa_enqueue
/home-local/jenkins-local/jenkins-agent/workspace/Apply-Custom-Patch-Set/dpdk/drivers/event/dpaa2/dpaa2_eventdev.c: At top level:
cc1: error: unrecognized command line option ‘-Wno-address-of-packed-member’ [-Werror]
cc1: all warnings being treated as errors
/home-local/jenkins-local/jenkins-agent/workspace/Apply-Custom-Patch-Set/dpdk/mk/internal/rte.compile-pre.mk:114: recipe for target 'dpaa2_eventdev.o' failed
make[6]: *** [dpaa2_eventdev.o] Error 1
/home-local/jenkins-local/jenkins-agent/workspace/Apply-Custom-Patch-Set/dpdk/mk/rte.subdir.mk:35: recipe for target 'dpaa2' failed
make[5]: *** [dpaa2] Error 2
/home-local/jenkins-local/jenkins-agent/workspace/Apply-Custom-Patch-Set/dpdk/mk/rte.subdir.mk:35: recipe for target 'event' failed
make[4]: *** [event] Error 2
/home-local/jenkins-local/jenkins-agent/workspace/Apply-Custom-Patch-Set/dpdk/mk/rte.sdkbuild.mk:46: recipe for target 'drivers' failed
make[3]: *** [drivers] Error 2
/home-local/jenkins-local/jenkins-agent/workspace/Apply-Custom-Patch-Set/dpdk/mk/rte.sdkroot.mk:98: recipe for target 'all' failed
make[2]: *** [all] Error 2
/home-local/jenkins-local/jenkins-agent/workspace/Apply-Custom-Patch-Set/dpdk/mk/rte.sdkinstall.mk:60: recipe for target 'pre_install' failed
make[1]: *** [pre_install] Error 2
/home-local/jenkins-local/jenkins-agent/workspace/Apply-Custom-Patch-Set/dpdk/mk/rte.sdkroot.mk:77: recipe for target 'install' failed
make: *** [install] Error 2

Need Help?

Visit our Bugzilla or our Slack workspace with any questions about infrastructure.

Copyright © 2022 DPDK Project. Hosted by the University of New Hampshire InterOperability Laboratory.