Patch set 76275

[V1] testpmd: add eeprom/module eeprom display

Submitter
David Liu
Applied on
dpdk-next-net (14c8e679ee5650d5f3a0c0a1c86f3d6e2691ba29)
Date submitted
Sept. 1, 2020, 7:07 p.m.

Test Results Build Error

=========================== WARNING ============================
It is recommended to build DPDK using 'meson' and 'ninja'
See https://doc.dpdk.org/guides/linux_gsg/build_dpdk.html
Building DPDK with 'make' will be deprecated in a future release
================================================================

Configuration done using x86_64-native-linuxapp-gcc

=========================== WARNING ============================
It is recommended to build DPDK using 'meson' and 'ninja'
See https://doc.dpdk.org/guides/linux_gsg/build_dpdk.html
Building DPDK with 'make' will be deprecated in a future release
================================================================

== Build lib
== Build lib/librte_kvargs
== Build lib/librte_telemetry
== Build lib/librte_eal
/home-local/jenkins-local/jenkins-agent/workspace/Apply-Custom-Patch-Set/dpdk/mk/toolchain/gcc/rte.toolchain-compat.mk:30: AVX512 support disabled because of binutils 2.30. See Bug 97
== Build lib/librte_eal/include
== Build lib/librte_eal/linux
== Build lib/librte_pci
== Build lib/librte_ring
== Build lib/librte_stack
== Build lib/librte_mempool
== Build lib/librte_mbuf
== Build lib/librte_timer
== Build lib/librte_cfgfile
== Build lib/librte_net
== Build lib/librte_cmdline
== Build lib/librte_meter
== Build lib/librte_ethdev
== Build lib/librte_bbdev
== Build lib/librte_cryptodev
== Build lib/librte_security
== Build lib/librte_compressdev
== Build lib/librte_regexdev
== Build lib/librte_hash
== Build lib/librte_eventdev
== Build lib/librte_rawdev
== Build lib/librte_vhost
== Build lib/librte_efd
== Build lib/librte_rib
== Build lib/librte_fib
== Build lib/librte_rcu
== Build lib/librte_lpm
== Build lib/librte_acl
== Build lib/librte_member
== Build lib/librte_ip_frag
== Build lib/librte_gro
== Build lib/librte_jobstats
== Build lib/librte_metrics
== Build lib/librte_bitratestats
== Build lib/librte_latencystats
== Build lib/librte_power
== Build lib/librte_sched
== Build lib/librte_kni
== Build lib/librte_port
== Build lib/librte_table
== Build lib/librte_flow_classify
== Build lib/librte_distributor
== Build lib/librte_pipeline
== Build lib/librte_reorder
== Build lib/librte_pdump
== Build lib/librte_gso
== Build lib/librte_bpf
== Build lib/librte_ipsec
== Build lib/librte_graph
== Build lib/librte_node
== Build buildtools
== Build buildtools/pmdinfogen
== Build kernel
== Build kernel/linux
== Build drivers
== Build drivers/common
== Build drivers/common/cpt
== Build drivers/common/octeontx
== Build drivers/common/octeontx2
== Build drivers/common/dpaax
== Build drivers/common/iavf
== Build drivers/bus
== Build drivers/bus/dpaa
== Build drivers/bus/fslmc
== Build drivers/bus/ifpga
== Build drivers/bus/pci
== Build drivers/bus/vdev
== Build drivers/bus/vmbus
== Build drivers/mempool
== Build drivers/mempool/bucket
== Build drivers/mempool/dpaa
== Build drivers/mempool/dpaa2
== Build drivers/mempool/ring
== Build drivers/mempool/stack
== Build drivers/mempool/octeontx
== Build drivers/mempool/octeontx2
== Build drivers/net
== Build drivers/net/af_packet
== Build drivers/net/ark
== Build drivers/net/atlantic
== Build drivers/net/avp
== Build drivers/net/axgbe
== Build drivers/net/bonding
== Build drivers/net/cxgbe
== Build drivers/net/dpaa
== Build drivers/net/dpaa2
== Build drivers/net/e1000
== Build drivers/net/ena
== Build drivers/net/enetc
== Build drivers/net/enic
== Build drivers/net/failsafe
== Build drivers/net/fm10k
== Build drivers/net/hinic
== Build drivers/net/hns3
== Build drivers/net/i40e
== Build drivers/net/iavf
== Build drivers/net/ice
== Build drivers/net/igc
== Build drivers/net/ionic
== Build drivers/net/ixgbe
== Build drivers/net/liquidio
== Build drivers/net/memif
== Build drivers/net/netvsc
== Build drivers/net/nfp
== Build drivers/net/bnxt
== Build drivers/net/null
== Build drivers/net/octeontx
== Build drivers/net/octeontx2
== Build drivers/net/qede
== Build drivers/net/ring
== Build drivers/net/sfc
== Build drivers/net/tap
== Build drivers/net/thunderx
== Build drivers/net/vdev_netvsc
== Build drivers/net/virtio
== Build drivers/net/vmxnet3
== Build drivers/net/kni
== Build drivers/net/softnic
== Build drivers/net/vhost
== Build drivers/baseband
== Build drivers/baseband/null
== Build drivers/baseband/turbo_sw
== Build drivers/baseband/fpga_lte_fec
== Build drivers/baseband/fpga_5gnr_fec
== Build drivers/crypto
== Build drivers/crypto/octeontx
== Build drivers/crypto/octeontx2
== Build drivers/crypto/scheduler
== Build drivers/crypto/null
== Build drivers/crypto/dpaa2_sec
== Build drivers/crypto/dpaa_sec
== Build drivers/crypto/caam_jr
== Build drivers/crypto/virtio
== Build drivers/crypto/nitrox
== Build drivers/common/qat
== Build drivers/compress
== Build drivers/compress/octeontx
== Build drivers/regex
== Build drivers/vdpa
== Build drivers/vdpa/ifc
== Build drivers/event
== Build drivers/event/skeleton
== Build drivers/event/sw
== Build drivers/event/dsw
== Build drivers/event/octeontx
== Build drivers/event/octeontx2
== Build drivers/event/dpaa
== Build drivers/event/dpaa2
== Build drivers/event/opdl
== Build drivers/raw
== Build drivers/raw/skeleton
== Build drivers/raw/dpaa2_cmdif
== Build drivers/raw/dpaa2_qdma
== Build drivers/raw/ioat
== Build drivers/raw/ntb
== Build drivers/raw/octeontx2_dma
== Build drivers/raw/octeontx2_ep
== Build app
== Build app/test
== Build app/test-pmd
  CC config.o
/home-local/jenkins-local/jenkins-agent/workspace/Apply-Custom-Patch-Set/dpdk/app/test-pmd/config.c:849:1: error: no previous prototype for ‘port_module_eeprom_displao’ [-Werror=missing-prototypes]
 port_module_eeprom_displao(portid_t port_id)
 ^~~~~~~~~~~~~~~~~~~~~~~~~~
/home-local/jenkins-local/jenkins-agent/workspace/Apply-Custom-Patch-Set/dpdk/app/test-pmd/config.c: In function ‘port_module_eeprom_displao’:
/home-local/jenkins-local/jenkins-agent/workspace/Apply-Custom-Patch-Set/dpdk/app/test-pmd/config.c:879:29: error: comparison of unsigned expression < 0 is always false [-Werror=type-limits]
        if (minfo.eeprom_len < 0){
                             ^
/home-local/jenkins-local/jenkins-agent/workspace/Apply-Custom-Patch-Set/dpdk/app/test-pmd/config.c: At top level:
cc1: error: unrecognized command line option ‘-Wno-address-of-packed-member’ [-Werror]
cc1: all warnings being treated as errors
/home-local/jenkins-local/jenkins-agent/workspace/Apply-Custom-Patch-Set/dpdk/mk/internal/rte.compile-pre.mk:114: recipe for target 'config.o' failed
make[5]: *** [config.o] Error 1
/home-local/jenkins-local/jenkins-agent/workspace/Apply-Custom-Patch-Set/dpdk/mk/rte.subdir.mk:35: recipe for target 'test-pmd' failed
make[4]: *** [test-pmd] Error 2
/home-local/jenkins-local/jenkins-agent/workspace/Apply-Custom-Patch-Set/dpdk/mk/rte.sdkbuild.mk:51: recipe for target 'app' failed
make[3]: *** [app] Error 2
/home-local/jenkins-local/jenkins-agent/workspace/Apply-Custom-Patch-Set/dpdk/mk/rte.sdkroot.mk:113: recipe for target 'all' failed
make[2]: *** [all] Error 2
/home-local/jenkins-local/jenkins-agent/workspace/Apply-Custom-Patch-Set/dpdk/mk/rte.sdkinstall.mk:60: recipe for target 'pre_install' failed
make[1]: *** [pre_install] Error 2
/home-local/jenkins-local/jenkins-agent/workspace/Apply-Custom-Patch-Set/dpdk/mk/rte.sdkroot.mk:92: recipe for target 'install' failed
make: *** [install] Error 2