Patch set 75311–75317

acl: introduce AVX512 classify method

Submitter
Konstantin Ananyev
Applied on
dpdk (b416a68ad7504c61ca64aa9ca3278d5670ea5d91)
Date submitted
Aug. 7, 2020, 4:28 p.m.

Test Results Build Error

=========================== WARNING ============================
It is recommended to build DPDK using 'meson' and 'ninja'
See https://doc.dpdk.org/guides/linux_gsg/build_dpdk.html
Building DPDK with 'make' will be deprecated in a future release
================================================================

Configuration done using x86_64-native-linuxapp-gcc

=========================== WARNING ============================
It is recommended to build DPDK using 'meson' and 'ninja'
See https://doc.dpdk.org/guides/linux_gsg/build_dpdk.html
Building DPDK with 'make' will be deprecated in a future release
================================================================

== Build lib
== Build lib/librte_kvargs
== Build lib/librte_telemetry
== Build lib/librte_eal
/home-local/jenkins-local/jenkins-agent/workspace/Apply-Custom-Patch-Set/dpdk/mk/toolchain/gcc/rte.toolchain-compat.mk:30: AVX512 support disabled because of binutils 2.30. See Bug 97
== Build lib/librte_eal/include
== Build lib/librte_eal/linux
== Build lib/librte_pci
== Build lib/librte_ring
== Build lib/librte_stack
== Build lib/librte_mempool
== Build lib/librte_mbuf
== Build lib/librte_timer
== Build lib/librte_cfgfile
== Build lib/librte_net
  SYMLINK-FILE include/rte_ip.h
  SYMLINK-FILE include/rte_tcp.h
  SYMLINK-FILE include/rte_udp.h
  SYMLINK-FILE include/rte_esp.h
  SYMLINK-FILE include/rte_sctp.h
  SYMLINK-FILE include/rte_icmp.h
  SYMLINK-FILE include/rte_arp.h
  SYMLINK-FILE include/rte_ether.h
  SYMLINK-FILE include/rte_gre.h
  SYMLINK-FILE include/rte_net.h
  SYMLINK-FILE include/rte_net_crc.h
  SYMLINK-FILE include/rte_mpls.h
  SYMLINK-FILE include/rte_higig.h
  SYMLINK-FILE include/rte_gtp.h
  SYMLINK-FILE include/rte_vxlan.h
  SYMLINK-FILE include/rte_ecpri.h
  CC rte_net.o
  CC rte_net_crc.o
  CC rte_ether.o
  CC rte_arp.o
  AR librte_net.a
  INSTALL-LIB librte_net.a
== Build lib/librte_cmdline
  SYMLINK-FILE include/cmdline.h
  SYMLINK-FILE include/cmdline_parse.h
  SYMLINK-FILE include/cmdline_parse_num.h
  SYMLINK-FILE include/cmdline_parse_ipaddr.h
  SYMLINK-FILE include/cmdline_parse_etheraddr.h
  SYMLINK-FILE include/cmdline_parse_string.h
  SYMLINK-FILE include/cmdline_rdline.h
  SYMLINK-FILE include/cmdline_vt100.h
  SYMLINK-FILE include/cmdline_socket.h
  SYMLINK-FILE include/cmdline_cirbuf.h
  SYMLINK-FILE include/cmdline_parse_portlist.h
  CC cmdline.o
  CC cmdline_cirbuf.o
  CC cmdline_parse.o
  CC cmdline_parse_etheraddr.o
  CC cmdline_parse_ipaddr.o
  CC cmdline_parse_num.o
  CC cmdline_parse_string.o
  CC cmdline_rdline.o
  CC cmdline_vt100.o
  CC cmdline_socket.o
  CC cmdline_parse_portlist.o
  AR librte_cmdline.a
  INSTALL-LIB librte_cmdline.a
== Build lib/librte_meter
== Build lib/librte_ethdev
  SYMLINK-FILE include/rte_ethdev.h
  SYMLINK-FILE include/rte_ethdev_driver.h
  SYMLINK-FILE include/rte_ethdev_core.h
  SYMLINK-FILE include/rte_ethdev_pci.h
  SYMLINK-FILE include/rte_ethdev_trace.h
  SYMLINK-FILE include/rte_ethdev_trace_fp.h
  SYMLINK-FILE include/rte_ethdev_vdev.h
  SYMLINK-FILE include/rte_eth_ctrl.h
  SYMLINK-FILE include/rte_dev_info.h
  SYMLINK-FILE include/rte_flow.h
  SYMLINK-FILE include/rte_flow_driver.h
  SYMLINK-FILE include/rte_tm.h
  SYMLINK-FILE include/rte_tm_driver.h
  SYMLINK-FILE include/rte_mtr.h
  SYMLINK-FILE include/rte_mtr_driver.h
  CC ethdev_private.o
  CC rte_ethdev.o
  CC rte_class_eth.o
  CC rte_flow.o
  CC rte_tm.o
  CC rte_mtr.o
  CC ethdev_profile.o
  CC ethdev_trace_points.o
  AR librte_ethdev.a
  INSTALL-LIB librte_ethdev.a
== Build lib/librte_bbdev
  SYMLINK-FILE include/rte_bbdev_op.h
  SYMLINK-FILE include/rte_bbdev.h
  SYMLINK-FILE include/rte_bbdev_pmd.h
  CC rte_bbdev.o
  AR librte_bbdev.a
  INSTALL-LIB librte_bbdev.a
== Build lib/librte_cryptodev
  SYMLINK-FILE include/rte_crypto.h
  SYMLINK-FILE include/rte_crypto_asym.h
  SYMLINK-FILE include/rte_crypto_sym.h
  SYMLINK-FILE include/rte_cryptodev.h
  SYMLINK-FILE include/rte_cryptodev_pmd.h
  SYMLINK-FILE include/rte_cryptodev_trace.h
  SYMLINK-FILE include/rte_cryptodev_trace_fp.h
  CC rte_cryptodev.o
  CC rte_cryptodev_pmd.o
  CC cryptodev_trace_points.o
  AR librte_cryptodev.a
  INSTALL-LIB librte_cryptodev.a
== Build lib/librte_security
  SYMLINK-FILE include/rte_security.h
  SYMLINK-FILE include/rte_security_driver.h
  CC rte_security.o
  AR librte_security.a
  INSTALL-LIB librte_security.a
== Build lib/librte_compressdev
  SYMLINK-FILE include/rte_comp.h
  SYMLINK-FILE include/rte_compressdev.h
  SYMLINK-FILE include/rte_compressdev_pmd.h
  SYMLINK-FILE include/rte_compressdev_internal.h
  CC rte_compressdev.o
  CC rte_compressdev_pmd.o
  CC rte_comp.o
  AR librte_compressdev.a
  INSTALL-LIB librte_compressdev.a
== Build lib/librte_regexdev
  SYMLINK-FILE include/rte_regexdev.h
  SYMLINK-FILE include/rte_regexdev_core.h
  SYMLINK-FILE include/rte_regexdev_driver.h
  CC rte_regexdev.o
  AR librte_regexdev.a
  INSTALL-LIB librte_regexdev.a
== Build lib/librte_hash
== Build lib/librte_eventdev
  SYMLINK-FILE include/rte_eventdev.h
  SYMLINK-FILE include/rte_eventdev_pmd.h
  SYMLINK-FILE include/rte_eventdev_pmd_pci.h
  SYMLINK-FILE include/rte_eventdev_pmd_vdev.h
  SYMLINK-FILE include/rte_eventdev_trace.h
  SYMLINK-FILE include/rte_eventdev_trace_fp.h
  SYMLINK-FILE include/rte_event_ring.h
  SYMLINK-FILE include/rte_event_eth_rx_adapter.h
  SYMLINK-FILE include/rte_event_timer_adapter.h
  SYMLINK-FILE include/rte_event_timer_adapter_pmd.h
  SYMLINK-FILE include/rte_event_crypto_adapter.h
  SYMLINK-FILE include/rte_event_eth_tx_adapter.h
  CC rte_eventdev.o
  CC rte_event_ring.o
  CC eventdev_trace_points.o
  CC rte_event_eth_rx_adapter.o
  CC rte_event_timer_adapter.o
  CC rte_event_crypto_adapter.o
  CC rte_event_eth_tx_adapter.o
  AR librte_eventdev.a
  INSTALL-LIB librte_eventdev.a
== Build lib/librte_rawdev
  SYMLINK-FILE include/rte_rawdev.h
  SYMLINK-FILE include/rte_rawdev_pmd.h
  CC rte_rawdev.o
  AR librte_rawdev.a
  INSTALL-LIB librte_rawdev.a
== Build lib/librte_vhost
  SYMLINK-FILE include/rte_vhost.h
  SYMLINK-FILE include/rte_vdpa.h
  SYMLINK-FILE include/rte_vdpa_dev.h
  SYMLINK-FILE include/rte_vhost_async.h
  SYMLINK-FILE include/rte_vhost_crypto.h
  CC fd_man.o
  CC iotlb.o
  CC socket.o
  CC vhost.o
  CC vhost_user.o
  CC virtio_net.o
  CC vdpa.o
  CC vhost_crypto.o
  AR librte_vhost.a
  INSTALL-LIB librte_vhost.a
== Build lib/librte_efd
  SYMLINK-FILE include/rte_efd.h
  CC rte_efd.o
  AR librte_efd.a
  INSTALL-LIB librte_efd.a
== Build lib/librte_rib
== Build lib/librte_fib
  SYMLINK-FILE include/rte_fib.h
  SYMLINK-FILE include/rte_fib6.h
  CC rte_fib.o
  CC rte_fib6.o
  CC dir24_8.o
  CC trie.o
  AR librte_fib.a
  INSTALL-LIB librte_fib.a
== Build lib/librte_rcu
== Build lib/librte_lpm
  SYMLINK-FILE include/rte_lpm.h
  SYMLINK-FILE include/rte_lpm6.h
  SYMLINK-FILE include/rte_lpm_sse.h
  CC rte_lpm.o
  CC rte_lpm6.o
  AR librte_lpm.a
  INSTALL-LIB librte_lpm.a
== Build lib/librte_acl
  CC acl_run_avx512.o
In file included from /home-local/jenkins-local/jenkins-agent/workspace/Apply-Custom-Patch-Set/dpdk/lib/librte_acl/acl_run_avx512.c:124:0:
/home-local/jenkins-local/jenkins-agent/workspace/Apply-Custom-Patch-Set/dpdk/lib/librte_acl/acl_run_avx512x16.h:10:14: error: unknown type name ‘__rte_x86_zmm_t’
 static const __rte_x86_zmm_t zmm_match_mask = {
              ^~~~~~~~~~~~~~~
/home-local/jenkins-local/jenkins-agent/workspace/Apply-Custom-Patch-Set/dpdk/lib/librte_acl/acl_run_avx512x16.h:11:2: error: field name not in record or union initializer
  .u32 = {
  ^
/home-local/jenkins-local/jenkins-agent/workspace/Apply-Custom-Patch-Set/dpdk/lib/librte_acl/acl_run_avx512x16.h:11:2: note: (near initialization for ‘zmm_match_mask’)
/home-local/jenkins-local/jenkins-agent/workspace/Apply-Custom-Patch-Set/dpdk/lib/librte_acl/acl_run_avx512x16.h:11:2: error: braces around scalar initializer [-Werror]
/home-local/jenkins-local/jenkins-agent/workspace/Apply-Custom-Patch-Set/dpdk/lib/librte_acl/acl_run_avx512x16.h:11:2: note: (near initialization for ‘zmm_match_mask’)
In file included from /home-local/jenkins-local/jenkins-agent/workspace/Apply-Custom-Patch-Set/dpdk/lib/librte_acl/acl_run.h:9:0,
                 from /home-local/jenkins-local/jenkins-agent/workspace/Apply-Custom-Patch-Set/dpdk/lib/librte_acl/acl_run_sse.h:5,
                 from /home-local/jenkins-local/jenkins-agent/workspace/Apply-Custom-Patch-Set/dpdk/lib/librte_acl/acl_run_avx512.c:5:
/home-local/jenkins-local/jenkins-agent/workspace/Apply-Custom-Patch-Set/dpdk/lib/librte_acl/acl.h:37:28: error: excess elements in scalar initializer [-Werror]
 #define RTE_ACL_NODE_MATCH (4U << RTE_ACL_TYPE_SHIFT)
                            ^
/home-local/jenkins-local/jenkins-agent/workspace/Apply-Custom-Patch-Set/dpdk/lib/librte_acl/acl_run_avx512x16.h:13:3: note: in expansion of macro ‘RTE_ACL_NODE_MATCH’
   RTE_ACL_NODE_MATCH,
   ^~~~~~~~~~~~~~~~~~
/home-local/jenkins-local/jenkins-agent/workspace/Apply-Custom-Patch-Set/dpdk/lib/librte_acl/acl.h:37:28: note: (near initialization for ‘zmm_match_mask’)
 #define RTE_ACL_NODE_MATCH (4U << RTE_ACL_TYPE_SHIFT)
                            ^
/home-local/jenkins-local/jenkins-agent/workspace/Apply-Custom-Patch-Set/dpdk/lib/librte_acl/acl_run_avx512x16.h:13:3: note: in expansion of macro ‘RTE_ACL_NODE_MATCH’
   RTE_ACL_NODE_MATCH,
   ^~~~~~~~~~~~~~~~~~
/home-local/jenkins-local/jenkins-agent/workspace/Apply-Custom-Patch-Set/dpdk/lib/librte_acl/acl.h:37:28: error: excess elements in scalar initializer [-Werror]
 #define RTE_ACL_NODE_MATCH (4U << RTE_ACL_TYPE_SHIFT)
                            ^
/home-local/jenkins-local/jenkins-agent/workspace/Apply-Custom-Patch-Set/dpdk/lib/librte_acl/acl_run_avx512x16.h:14:3: note: in expansion of macro ‘RTE_ACL_NODE_MATCH’
   RTE_ACL_NODE_MATCH,
   ^~~~~~~~~~~~~~~~~~
/home-local/jenkins-local/jenkins-agent/workspace/Apply-Custom-Patch-Set/dpdk/lib/librte_acl/acl.h:37:28: note: (near initialization for ‘zmm_match_mask’)
 #define RTE_ACL_NODE_MATCH (4U << RTE_ACL_TYPE_SHIFT)
                            ^
/home-local/jenkins-local/jenkins-agent/workspace/Apply-Custom-Patch-Set/dpdk/lib/librte_acl/acl_run_avx512x16.h:14:3: note: in expansion of macro ‘RTE_ACL_NODE_MATCH’
   RTE_ACL_NODE_MATCH,
   ^~~~~~~~~~~~~~~~~~
/home-local/jenkins-local/jenkins-agent/workspace/Apply-Custom-Patch-Set/dpdk/lib/librte_acl/acl.h:37:28: error: excess elements in scalar initializer [-Werror]
 #define RTE_ACL_NODE_MATCH (4U << RTE_ACL_TYPE_SHIFT)
                            ^
/home-local/jenkins-local/jenkins-agent/workspace/Apply-Custom-Patch-Set/dpdk/lib/librte_acl/acl_run_avx512x16.h:15:3: note: in expansion of macro ‘RTE_ACL_NODE_MATCH’
   RTE_ACL_NODE_MATCH,
   ^~~~~~~~~~~~~~~~~~
/home-local/jenkins-local/jenkins-agent/workspace/Apply-Custom-Patch-Set/dpdk/lib/librte_acl/acl.h:37:28: note: (near initialization for ‘zmm_match_mask’)
 #define RTE_ACL_NODE_MATCH (4U << RTE_ACL_TYPE_SHIFT)
                            ^
/home-local/jenkins-local/jenkins-agent/workspace/Apply-Custom-Patch-Set/dpdk/lib/librte_acl/acl_run_avx512x16.h:15:3: note: in expansion of macro ‘RTE_ACL_NODE_MATCH’
   RTE_ACL_NODE_MATCH,
   ^~~~~~~~~~~~~~~~~~
/home-local/jenkins-local/jenkins-agent/workspace/Apply-Custom-Patch-Set/dpdk/lib/librte_acl/acl.h:37:28: error: excess elements in scalar initializer [-Werror]
 #define RTE_ACL_NODE_MATCH (4U << RTE_ACL_TYPE_SHIFT)
                            ^
/home-local/jenkins-local/jenkins-agent/workspace/Apply-Custom-Patch-Set/dpdk/lib/librte_acl/acl_run_avx512x16.h:16:3: note: in expansion of macro ‘RTE_ACL_NODE_MATCH’
   RTE_ACL_NODE_MATCH,
   ^~~~~~~~~~~~~~~~~~
/home-local/jenkins-local/jenkins-agent/workspace/Apply-Custom-Patch-Set/dpdk/lib/librte_acl/acl.h:37:28: note: (near initialization for ‘zmm_match_mask’)
 #define RTE_ACL_NODE_MATCH (4U << RTE_ACL_TYPE_SHIFT)
                            ^
/home-local/jenkins-local/jenkins-agent/workspace/Apply-Custom-Patch-Set/dpdk/lib/librte_acl/acl_run_avx512x16.h:16:3: note: in expansion of macro ‘RTE_ACL_NODE_MATCH’
   RTE_ACL_NODE_MATCH,
   ^~~~~~~~~~~~~~~~~~
/home-local/jenkins-local/jenkins-agent/workspace/Apply-Custom-Patch-Set/dpdk/lib/librte_acl/acl.h:37:28: error: excess elements in scalar initializer [-Werror]
 #define RTE_ACL_NODE_MATCH (4U << RTE_ACL_TYPE_SHIFT)
                            ^
/home-local/jenkins-local/jenkins-agent/workspace/Apply-Custom-Patch-Set/dpdk/lib/librte_acl/acl_run_avx512x16.h:17:3: note: in expansion of macro ‘RTE_ACL_NODE_MATCH’
   RTE_ACL_NODE_MATCH,
   ^~~~~~~~~~~~~~~~~~
/home-local/jenkins-local/jenkins-agent/workspace/Apply-Custom-Patch-Set/dpdk/lib/librte_acl/acl.h:37:28: note: (near initialization for ‘zmm_match_mask’)
 #define RTE_ACL_NODE_MATCH (4U << RTE_ACL_TYPE_SHIFT)
                            ^
/home-local/jenkins-local/jenkins-agent/workspace/Apply-Custom-Patch-Set/dpdk/lib/librte_acl/acl_run_avx512x16.h:17:3: note: in expansion of macro ‘RTE_ACL_NODE_MATCH’
   RTE_ACL_NODE_MATCH,
   ^~~~~~~~~~~~~~~~~~
/home-local/jenkins-local/jenkins-agent/workspace/Apply-Custom-Patch-Set/dpdk/lib/librte_acl/acl.h:37:28: error: excess elements in scalar initializer [-Werror]
 #define RTE_ACL_NODE_MATCH (4U << RTE_ACL_TYPE_SHIFT)
                            ^
/home-local/jenkins-local/jenkins-agent/workspace/Apply-Custom-Patch-Set/dpdk/lib/librte_acl/acl_run_avx512x16.h:18:3: note: in expansion of macro ‘RTE_ACL_NODE_MATCH’
   RTE_ACL_NODE_MATCH,
   ^~~~~~~~~~~~~~~~~~
/home-local/jenkins-local/jenkins-agent/workspace/Apply-Custom-Patch-Set/dpdk/lib/librte_acl/acl.h:37:28: note: (near initialization for ‘zmm_match_mask’)
 #define RTE_ACL_NODE_MATCH (4U << RTE_ACL_TYPE_SHIFT)
                            ^
/home-local/jenkins-local/jenkins-agent/workspace/Apply-Custom-Patch-Set/dpdk/lib/librte_acl/acl_run_avx512x16.h:18:3: note: in expansion of macro ‘RTE_ACL_NODE_MATCH’
   RTE_ACL_NODE_MATCH,
   ^~~~~~~~~~~~~~~~~~
/home-local/jenkins-local/jenkins-agent/workspace/Apply-Custom-Patch-Set/dpdk/lib/librte_acl/acl.h:37:28: error: excess elements in scalar initializer [-Werror]
 #define RTE_ACL_NODE_MATCH (4U << RTE_ACL_TYPE_SHIFT)
                            ^
/home-local/jenkins-local/jenkins-agent/workspace/Apply-Custom-Patch-Set/dpdk/lib/librte_acl/acl_run_avx512x16.h:19:3: note: in expansion of macro ‘RTE_ACL_NODE_MATCH’
   RTE_ACL_NODE_MATCH,
   ^~~~~~~~~~~~~~~~~~
/home-local/jenkins-local/jenkins-agent/workspace/Apply-Custom-Patch-Set/dpdk/lib/librte_acl/acl.h:37:28: note: (near initialization for ‘zmm_match_mask’)
 #define RTE_ACL_NODE_MATCH (4U << RTE_ACL_TYPE_SHIFT)
                            ^
/home-local/jenkins-local/jenkins-agent/workspace/Apply-Custom-Patch-Set/dpdk/lib/librte_acl/acl_run_avx512x16.h:19:3: note: in expansion of macro ‘RTE_ACL_NODE_MATCH’
   RTE_ACL_NODE_MATCH,
   ^~~~~~~~~~~~~~~~~~
/home-local/jenkins-local/jenkins-agent/workspace/Apply-Custom-Patch-Set/dpdk/lib/librte_acl/acl.h:37:28: error: excess elements in scalar initializer [-Werror]
 #define RTE_ACL_NODE_MATCH (4U << RTE_ACL_TYPE_SHIFT)
                            ^
/home-local/jenkins-local/jenkins-agent/workspace/Apply-Custom-Patch-Set/dpdk/lib/librte_acl/acl_run_avx512x16.h:20:3: note: in expansion of macro ‘RTE_ACL_NODE_MATCH’
   RTE_ACL_NODE_MATCH,
   ^~~~~~~~~~~~~~~~~~
/home-local/jenkins-local/jenkins-agent/workspace/Apply-Custom-Patch-Set/dpdk/lib/librte_acl/acl.h:37:28: note: (near initialization for ‘zmm_match_mask’)
 #define RTE_ACL_NODE_MATCH (4U << RTE_ACL_TYPE_SHIFT)
                            ^
/home-local/jenkins-local/jenkins-agent/workspace/Apply-Custom-Patch-Set/dpdk/lib/librte_acl/acl_run_avx512x16.h:20:3: note: in expansion of macro ‘RTE_ACL_NODE_MATCH’
   RTE_ACL_NODE_MATCH,
   ^~~~~~~~~~~~~~~~~~
/home-local/jenkins-local/jenkins-agent/workspace/Apply-Custom-Patch-Set/dpdk/lib/librte_acl/acl.h:37:28: error: excess elements in scalar initializer [-Werror]
 #define RTE_ACL_NODE_MATCH (4U << RTE_ACL_TYPE_SHIFT)
                            ^
/home-local/jenkins-local/jenkins-agent/workspace/Apply-Custom-Patch-Set/dpdk/lib/librte_acl/acl_run_avx512x16.h:21:3: note: in expansion of macro ‘RTE_ACL_NODE_MATCH’
   RTE_ACL_NODE_MATCH,
   ^~~~~~~~~~~~~~~~~~
/home-local/jenkins-local/jenkins-agent/workspace/Apply-Custom-Patch-Set/dpdk/lib/librte_acl/acl.h:37:28: note: (near initialization for ‘zmm_match_mask’)
 #define RTE_ACL_NODE_MATCH (4U << RTE_ACL_TYPE_SHIFT)
                            ^
/home-local/jenkins-local/jenkins-agent/workspace/Apply-Custom-Patch-Set/dpdk/lib/librte_acl/acl_run_avx512x16.h:21:3: note: in expansion of macro ‘RTE_ACL_NODE_MATCH’
   RTE_ACL_NODE_MATCH,
   ^~~~~~~~~~~~~~~~~~
/home-local/jenkins-local/jenkins-agent/workspace/Apply-Custom-Patch-Set/dpdk/lib/librte_acl/acl.h:37:28: error: excess elements in scalar initializer [-Werror]
 #define RTE_ACL_NODE_MATCH (4U << RTE_ACL_TYPE_SHIFT)
                            ^
/home-local/jenkins-local/jenkins-agent/workspace/Apply-Custom-Patch-Set/dpdk/lib/librte_acl/acl_run_avx512x16.h:22:3: note: in expansion of macro ‘RTE_ACL_NODE_MATCH’
   RTE_ACL_NODE_MATCH,
   ^~~~~~~~~~~~~~~~~~
/home-local/jenkins-local/jenkins-agent/workspace/Apply-Custom-Patch-Set/dpdk/lib/librte_acl/acl.h:37:28: note: (near initialization for ‘zmm_match_mask’)
 #define RTE_ACL_NODE_MATCH (4U << RTE_ACL_TYPE_SHIFT)
                            ^
/home-local/jenkins-local/jenkins-agent/workspace/Apply-Custom-Patch-Set/dpdk/lib/librte_acl/acl_run_avx512x16.h:22:3: note: in expansion of macro ‘RTE_ACL_NODE_MATCH’
   RTE_ACL_NODE_MATCH,
   ^~~~~~~~~~~~~~~~~~
/home-local/jenkins-local/jenkins-agent/workspace/Apply-Custom-Patch-Set/dpdk/lib/librte_acl/acl.h:37:28: error: excess elements in scalar initializer [-Werror]
 #define RTE_ACL_NODE_MATCH (4U << RTE_ACL_TYPE_SHIFT)
                            ^
/home-local/jenkins-local/jenkins-agent/workspace/Apply-Custom-Patch-Set/dpdk/lib/librte_acl/acl_run_avx512x16.h:23:3: note: in expansion of macro ‘RTE_ACL_NODE_MATCH’
   RTE_ACL_NODE_MATCH,
   ^~~~~~~~~~~~~~~~~~
/home-local/jenkins-local/jenkins-agent/workspace/Apply-Custom-Patch-Set/dpdk/lib/librte_acl/acl.h:37:28: note: (near initialization for ‘zmm_match_mask’)
 #define RTE_ACL_NODE_MATCH (4U << RTE_ACL_TYPE_SHIFT)
                            ^
/home-local/jenkins-local/jenkins-agent/workspace/Apply-Custom-Patch-Set/dpdk/lib/librte_acl/acl_run_avx512x16.h:23:3: note: in expansion of macro ‘RTE_ACL_NODE_MATCH’
   RTE_ACL_NODE_MATCH,
   ^~~~~~~~~~~~~~~~~~
/home-local/jenkins-local/jenkins-agent/workspace/Apply-Custom-Patch-Set/dpdk/lib/librte_acl/acl.h:37:28: error: excess elements in scalar initializer [-Werror]
 #define RTE_ACL_NODE_MATCH (4U << RTE_ACL_TYPE_SHIFT)
                            ^
/home-local/jenkins-local/jenkins-agent/workspace/Apply-Custom-Patch-Set/dpdk/lib/librte_acl/acl_run_avx512x16.h:24:3: note: in expansion of macro ‘RTE_ACL_NODE_MATCH’
   RTE_ACL_NODE_MATCH,
   ^~~~~~~~~~~~~~~~~~
/home-local/jenkins-local/jenkins-agent/workspace/Apply-Custom-Patch-Set/dpdk/lib/librte_acl/acl.h:37:28: note: (near initialization for ‘zmm_match_mask’)
 #define RTE_ACL_NODE_MATCH (4U << RTE_ACL_TYPE_SHIFT)
                            ^
/home-local/jenkins-local/jenkins-agent/workspace/Apply-Custom-Patch-Set/dpdk/lib/librte_acl/acl_run_avx512x16.h:24:3: note: in expansion of macro ‘RTE_ACL_NODE_MATCH’
   RTE_ACL_NODE_MATCH,
   ^~~~~~~~~~~~~~~~~~
/home-local/jenkins-local/jenkins-agent/workspace/Apply-Custom-Patch-Set/dpdk/lib/librte_acl/acl.h:37:28: error: excess elements in scalar initializer [-Werror]
 #define RTE_ACL_NODE_MATCH (4U << RTE_ACL_TYPE_SHIFT)
                            ^
/home-local/jenkins-local/jenkins-agent/workspace/Apply-Custom-Patch-Set/dpdk/lib/librte_acl/acl_run_avx512x16.h:25:3: note: in expansion of macro ‘RTE_ACL_NODE_MATCH’
   RTE_ACL_NODE_MATCH,
   ^~~~~~~~~~~~~~~~~~
/home-local/jenkins-local/jenkins-agent/workspace/Apply-Custom-Patch-Set/dpdk/lib/librte_acl/acl.h:37:28: note: (near initialization for ‘zmm_match_mask’)
 #define RTE_ACL_NODE_MATCH (4U << RTE_ACL_TYPE_SHIFT)
                            ^
/home-local/jenkins-local/jenkins-agent/workspace/Apply-Custom-Patch-Set/dpdk/lib/librte_acl/acl_run_avx512x16.h:25:3: note: in expansion of macro ‘RTE_ACL_NODE_MATCH’
   RTE_ACL_NODE_MATCH,
   ^~~~~~~~~~~~~~~~~~
/home-local/jenkins-local/jenkins-agent/workspace/Apply-Custom-Patch-Set/dpdk/lib/librte_acl/acl.h:37:28: error: excess elements in scalar initializer [-Werror]
 #define RTE_ACL_NODE_MATCH (4U << RTE_ACL_TYPE_SHIFT)
                            ^
/home-local/jenkins-local/jenkins-agent/workspace/Apply-Custom-Patch-Set/dpdk/lib/librte_acl/acl_run_avx512x16.h:26:3: note: in expansion of macro ‘RTE_ACL_NODE_MATCH’
   RTE_ACL_NODE_MATCH,
   ^~~~~~~~~~~~~~~~~~
/home-local/jenkins-local/jenkins-agent/workspace/Apply-Custom-Patch-Set/dpdk/lib/librte_acl/acl.h:37:28: note: (near initialization for ‘zmm_match_mask’)
 #define RTE_ACL_NODE_MATCH (4U << RTE_ACL_TYPE_SHIFT)
                            ^
/home-local/jenkins-local/jenkins-agent/workspace/Apply-Custom-Patch-Set/dpdk/lib/librte_acl/acl_run_avx512x16.h:26:3: note: in expansion of macro ‘RTE_ACL_NODE_MATCH’
   RTE_ACL_NODE_MATCH,
   ^~~~~~~~~~~~~~~~~~
/home-local/jenkins-local/jenkins-agent/workspace/Apply-Custom-Patch-Set/dpdk/lib/librte_acl/acl.h:37:28: error: excess elements in scalar initializer [-Werror]
 #define RTE_ACL_NODE_MATCH (4U << RTE_ACL_TYPE_SHIFT)
                            ^
/home-local/jenkins-local/jenkins-agent/workspace/Apply-Custom-Patch-Set/dpdk/lib/librte_acl/acl_run_avx512x16.h:27:3: note: in expansion of macro ‘RTE_ACL_NODE_MATCH’
   RTE_ACL_NODE_MATCH,
   ^~~~~~~~~~~~~~~~~~
/home-local/jenkins-local/jenkins-agent/workspace/Apply-Custom-Patch-Set/dpdk/lib/librte_acl/acl.h:37:28: note: (near initialization for ‘zmm_match_mask’)
 #define RTE_ACL_NODE_MATCH (4U << RTE_ACL_TYPE_SHIFT)
                            ^
/home-local/jenkins-local/jenkins-agent/workspace/Apply-Custom-Patch-Set/dpdk/lib/librte_acl/acl_run_avx512x16.h:27:3: note: in expansion of macro ‘RTE_ACL_NODE_MATCH’
   RTE_ACL_NODE_MATCH,
   ^~~~~~~~~~~~~~~~~~
In file included from /home-local/jenkins-local/jenkins-agent/workspace/Apply-Custom-Patch-Set/dpdk/lib/librte_acl/acl_run_avx512.c:124:0:
/home-local/jenkins-local/jenkins-agent/workspace/Apply-Custom-Patch-Set/dpdk/lib/librte_acl/acl_run_avx512x16.h:31:14: error: unknown type name ‘__rte_x86_zmm_t’
 static const __rte_x86_zmm_t zmm_index_mask = {
              ^~~~~~~~~~~~~~~
/home-local/jenkins-local/jenkins-agent/workspace/Apply-Custom-Patch-Set/dpdk/lib/librte_acl/acl_run_avx512x16.h:32:2: error: field name not in record or union initializer
  .u32 = {
  ^
/home-local/jenkins-local/jenkins-agent/workspace/Apply-Custom-Patch-Set/dpdk/lib/librte_acl/acl_run_avx512x16.h:32:2: note: (near initialization for ‘zmm_index_mask’)
/home-local/jenkins-local/jenkins-agent/workspace/Apply-Custom-Patch-Set/dpdk/lib/librte_acl/acl_run_avx512x16.h:32:2: error: braces around scalar initializer [-Werror]
/home-local/jenkins-local/jenkins-agent/workspace/Apply-Custom-Patch-Set/dpdk/lib/librte_acl/acl_run_avx512x16.h:32:2: note: (near initialization for ‘zmm_index_mask’)
In file included from /home-local/jenkins-local/jenkins-agent/workspace/Apply-Custom-Patch-Set/dpdk/lib/librte_acl/acl_run_sse.h:5:0,
                 from /home-local/jenkins-local/jenkins-agent/workspace/Apply-Custom-Patch-Set/dpdk/lib/librte_acl/acl_run_avx512.c:5:
/home-local/jenkins-local/jenkins-agent/workspace/Apply-Custom-Patch-Set/dpdk/lib/librte_acl/acl_run.h:22:28: error: excess elements in scalar initializer [-Werror]
 #define RTE_ACL_NODE_INDEX ((uint32_t)~RTE_ACL_NODE_TYPE)
                            ^
/home-local/jenkins-local/jenkins-agent/workspace/Apply-Custom-Patch-Set/dpdk/lib/librte_acl/acl_run_avx512x16.h:34:3: note: in expansion of macro ‘RTE_ACL_NODE_INDEX’
   RTE_ACL_NODE_INDEX,
   ^~~~~~~~~~~~~~~~~~
/home-local/jenkins-local/jenkins-agent/workspace/Apply-Custom-Patch-Set/dpdk/lib/librte_acl/acl_run.h:22:28: note: (near initialization for ‘zmm_index_mask’)
 #define RTE_ACL_NODE_INDEX ((uint32_t)~RTE_ACL_NODE_TYPE)
                            ^
/home-local/jenkins-local/jenkins-agent/workspace/Apply-Custom-Patch-Set/dpdk/lib/librte_acl/acl_run_avx512x16.h:34:3: note: in expansion of macro ‘RTE_ACL_NODE_INDEX’
   RTE_ACL_NODE_INDEX,
   ^~~~~~~~~~~~~~~~~~
/home-local/jenkins-local/jenkins-agent/workspace/Apply-Custom-Patch-Set/dpdk/lib/librte_acl/acl_run.h:22:28: error: excess elements in scalar initializer [-Werror]
 #define RTE_ACL_NODE_INDEX ((uint32_t)~RTE_ACL_NODE_TYPE)
                            ^
/home-local/jenkins-local/jenkins-agent/workspace/Apply-Custom-Patch-Set/dpdk/lib/librte_acl/acl_run_avx512x16.h:35:3: note: in expansion of macro ‘RTE_ACL_NODE_INDEX’
   RTE_ACL_NODE_INDEX,
   ^~~~~~~~~~~~~~~~~~
/home-local/jenkins-local/jenkins-agent/workspace/Apply-Custom-Patch-Set/dpdk/lib/librte_acl/acl_run.h:22:28: note: (near initialization for ‘zmm_index_mask’)
 #define RTE_ACL_NODE_INDEX ((uint32_t)~RTE_ACL_NODE_TYPE)
                            ^
/home-local/jenkins-local/jenkins-agent/workspace/Apply-Custom-Patch-Set/dpdk/lib/librte_acl/acl_run_avx512x16.h:35:3: note: in expansion of macro ‘RTE_ACL_NODE_INDEX’
   RTE_ACL_NODE_INDEX,
   ^~~~~~~~~~~~~~~~~~
/home-local/jenkins-local/jenkins-agent/workspace/Apply-Custom-Patch-Set/dpdk/lib/librte_acl/acl_run.h:22:28: error: excess elements in scalar initializer [-Werror]
 #define RTE_ACL_NODE_INDEX ((uint32_t)~RTE_ACL_NODE_TYPE)
                            ^
/home-local/jenkins-local/jenkins-agent/workspace/Apply-Custom-Patch-Set/dpdk/lib/librte_acl/acl_run_avx512x16.h:36:3: note: in expansion of macro ‘RTE_ACL_NODE_INDEX’
   RTE_ACL_NODE_INDEX,
   ^~~~~~~~~~~~~~~~~~
/home-local/jenkins-local/jenkins-agent/workspace/Apply-Custom-Patch-Set/dpdk/lib/librte_acl/acl_run.h:22:28: note: (near initialization for ‘zmm_index_mask’)
 #define RTE_ACL_NODE_INDEX ((uint32_t)~RTE_ACL_NODE_TYPE)
                            ^
/home-local/jenkins-local/jenkins-agent/workspace/Apply-Custom-Patch-Set/dpdk/lib/librte_acl/acl_run_avx512x16.h:36:3: note: in expansion of macro ‘RTE_ACL_NODE_INDEX’
   RTE_ACL_NODE_INDEX,
   ^~~~~~~~~~~~~~~~~~
/home-local/jenkins-local/jenkins-agent/workspace/Apply-Custom-Patch-Set/dpdk/lib/librte_acl/acl_run.h:22:28: error: excess elements in scalar initializer [-Werror]
 #define RTE_ACL_NODE_INDEX ((uint32_t)~RTE_ACL_NODE_TYPE)
                            ^
/home-local/jenkins-local/jenkins-agent/workspace/Apply-Custom-Patch-Set/dpdk/lib/librte_acl/acl_run_avx512x16.h:37:3: note: in expansion of macro ‘RTE_ACL_NODE_INDEX’
   RTE_ACL_NODE_INDEX,
   ^~~~~~~~~~~~~~~~~~
/home-local/jenkins-local/jenkins-agent/workspace/Apply-Custom-Patch-Set/dpdk/lib/librte_acl/acl_run.h:22:28: note: (near initialization for ‘zmm_index_mask’)
 #define RTE_ACL_NODE_INDEX ((uint32_t)~RTE_ACL_NODE_TYPE)
                            ^
/home-local/jenkins-local/jenkins-agent/workspace/Apply-Custom-Patch-Set/dpdk/lib/librte_acl/acl_run_avx512x16.h:37:3: note: in expansion of macro ‘RTE_ACL_NODE_INDEX’
   RTE_ACL_NODE_INDEX,
   ^~~~~~~~~~~~~~~~~~
/home-local/jenkins-local/jenkins-agent/workspace/Apply-Custom-Patch-Set/dpdk/lib/librte_acl/acl_run.h:22:28: error: excess elements in scalar initializer [-Werror]
 #define RTE_ACL_NODE_INDEX ((uint32_t)~RTE_ACL_NODE_TYPE)
                            ^
/home-local/jenkins-local/jenkins-agent/workspace/Apply-Custom-Patch-Set/dpdk/lib/librte_acl/acl_run_avx512x16.h:38:3: note: in expansion of macro ‘RTE_ACL_NODE_INDEX’
   RTE_ACL_NODE_INDEX,
   ^~~~~~~~~~~~~~~~~~
/home-local/jenkins-local/jenkins-agent/workspace/Apply-Custom-Patch-Set/dpdk/lib/librte_acl/acl_run.h:22:28: note: (near initialization for ‘zmm_index_mask’)
 #define RTE_ACL_NODE_INDEX ((uint32_t)~RTE_ACL_NODE_TYPE)
                            ^
/home-local/jenkins-local/jenkins-agent/workspace/Apply-Custom-Patch-Set/dpdk/lib/librte_acl/acl_run_avx512x16.h:38:3: note: in expansion of macro ‘RTE_ACL_NODE_INDEX’
   RTE_ACL_NODE_INDEX,
   ^~~~~~~~~~~~~~~~~~
/home-local/jenkins-local/jenkins-agent/workspace/Apply-Custom-Patch-Set/dpdk/lib/librte_acl/acl_run.h:22:28: error: excess elements in scalar initializer [-Werror]
 #define RTE_ACL_NODE_INDEX ((uint32_t)~RTE_ACL_NODE_TYPE)
                            ^
/home-local/jenkins-local/jenkins-agent/workspace/Apply-Custom-Patch-Set/dpdk/lib/librte_acl/acl_run_avx512x16.h:39:3: note: in expansion of macro ‘RTE_ACL_NODE_INDEX’
   RTE_ACL_NODE_INDEX,
   ^~~~~~~~~~~~~~~~~~
/home-local/jenkins-local/jenkins-agent/workspace/Apply-Custom-Patch-Set/dpdk/lib/librte_acl/acl_run.h:22:28: note: (near initialization for ‘zmm_index_mask’)
 #define RTE_ACL_NODE_INDEX ((uint32_t)~RTE_ACL_NODE_TYPE)
                            ^
/home-local/jenkins-local/jenkins-agent/workspace/Apply-Custom-Patch-Set/dpdk/lib/librte_acl/acl_run_avx512x16.h:39:3: note: in expansion of macro ‘RTE_ACL_NODE_INDEX’
   RTE_ACL_NODE_INDEX,
   ^~~~~~~~~~~~~~~~~~
/home-local/jenkins-local/jenkins-agent/workspace/Apply-Custom-Patch-Set/dpdk/lib/librte_acl/acl_run.h:22:28: error: excess elements in scalar initializer [-Werror]
 #define RTE_ACL_NODE_INDEX ((uint32_t)~RTE_ACL_NODE_TYPE)
                            ^
/home-local/jenkins-local/jenkins-agent/workspace/Apply-Custom-Patch-Set/dpdk/lib/librte_acl/acl_run_avx512x16.h:40:3: note: in expansion of macro ‘RTE_ACL_NODE_INDEX’
   RTE_ACL_NODE_INDEX,
   ^~~~~~~~~~~~~~~~~~
/home-local/jenkins-local/jenkins-agent/workspace/Apply-Custom-Patch-Set/dpdk/lib/librte_acl/acl_run.h:22:28: note: (near initialization for ‘zmm_index_mask’)
 #define RTE_ACL_NODE_INDEX ((uint32_t)~RTE_ACL_NODE_TYPE)
                            ^
/home-local/jenkins-local/jenkins-agent/workspace/Apply-Custom-Patch-Set/dpdk/lib/librte_acl/acl_run_avx512x16.h:40:3: note: in expansion of macro ‘RTE_ACL_NODE_INDEX’
   RTE_ACL_NODE_INDEX,
   ^~~~~~~~~~~~~~~~~~
/home-local/jenkins-local/jenkins-agent/workspace/Apply-Custom-Patch-Set/dpdk/lib/librte_acl/acl_run.h:22:28: error: excess elements in scalar initializer [-Werror]
 #define RTE_ACL_NODE_INDEX ((uint32_t)~RTE_ACL_NODE_TYPE)
                            ^
/home-local/jenkins-local/jenkins-agent/workspace/Apply-Custom-Patch-Set/dpdk/lib/librte_acl/acl_run_avx512x16.h:41:3: note: in expansion of macro ‘RTE_ACL_NODE_INDEX’
   RTE_ACL_NODE_INDEX,
   ^~~~~~~~~~~~~~~~~~
/home-local/jenkins-local/jenkins-agent/workspace/Apply-Custom-Patch-Set/dpdk/lib/librte_acl/acl_run.h:22:28: note: (near initialization for ‘zmm_index_mask’)
 #define RTE_ACL_NODE_INDEX ((uint32_t)~RTE_ACL_NODE_TYPE)
                            ^
/home-local/jenkins-local/jenkins-agent/workspace/Apply-Custom-Patch-Set/dpdk/lib/librte_acl/acl_run_avx512x16.h:41:3: note: in expansion of macro ‘RTE_ACL_NODE_INDEX’
   RTE_ACL_NODE_INDEX,
   ^~~~~~~~~~~~~~~~~~
/home-local/jenkins-local/jenkins-agent/workspace/Apply-Custom-Patch-Set/dpdk/lib/librte_acl/acl_run.h:22:28: error: excess elements in scalar initializer [-Werror]
 #define RTE_ACL_NODE_INDEX ((uint32_t)~RTE_ACL_NODE_TYPE)
                            ^
/home-local/jenkins-local/jenkins-agent/workspace/Apply-Custom-Patch-Set/dpdk/lib/librte_acl/acl_run_avx512x16.h:42:3: note: in expansion of macro ‘RTE_ACL_NODE_INDEX’
   RTE_ACL_NODE_INDEX,
   ^~~~~~~~~~~~~~~~~~
/home-local/jenkins-local/jenkins-agent/workspace/Apply-Custom-Patch-Set/dpdk/lib/librte_acl/acl_run.h:22:28: note: (near initialization for ‘zmm_index_mask’)
 #define RTE_ACL_NODE_INDEX ((uint32_t)~RTE_ACL_NODE_TYPE)
                            ^
/home-local/jenkins-local/jenkins-agent/workspace/Apply-Custom-Patch-Set/dpdk/lib/librte_acl/acl_run_avx512x16.h:42:3: note: in expansion of macro ‘RTE_ACL_NODE_INDEX’
   RTE_ACL_NODE_INDEX,
   ^~~~~~~~~~~~~~~~~~
/home-local/jenkins-local/jenkins-agent/workspace/Apply-Custom-Patch-Set/dpdk/lib/librte_acl/acl_run.h:22:28: error: excess elements in scalar initializer [-Werror]
 #define RTE_ACL_NODE_INDEX ((uint32_t)~RTE_ACL_NODE_TYPE)
                            ^
/home-local/jenkins-local/jenkins-agent/workspace/Apply-Custom-Patch-Set/dpdk/lib/librte_acl/acl_run_avx512x16.h:43:3: note: in expansion of macro ‘RTE_ACL_NODE_INDEX’
   RTE_ACL_NODE_INDEX,
   ^~~~~~~~~~~~~~~~~~
/home-local/jenkins-local/jenkins-agent/workspace/Apply-Custom-Patch-Set/dpdk/lib/librte_acl/acl_run.h:22:28: note: (near initialization for ‘zmm_index_mask’)
 #define RTE_ACL_NODE_INDEX ((uint32_t)~RTE_ACL_NODE_TYPE)
                            ^
/home-local/jenkins-local/jenkins-agent/workspace/Apply-Custom-Patch-Set/dpdk/lib/librte_acl/acl_run_avx512x16.h:43:3: note: in expansion of macro ‘RTE_ACL_NODE_INDEX’
   RTE_ACL_NODE_INDEX,
   ^~~~~~~~~~~~~~~~~~
/home-local/jenkins-local/jenkins-agent/workspace/Apply-Custom-Patch-Set/dpdk/lib/librte_acl/acl_run.h:22:28: error: excess elements in scalar initializer [-Werror]
 #define RTE_ACL_NODE_INDEX ((uint32_t)~RTE_ACL_NODE_TYPE)
                            ^
/home-local/jenkins-local/jenkins-agent/workspace/Apply-Custom-Patch-Set/dpdk/lib/librte_acl/acl_run_avx512x16.h:44:3: note: in expansion of macro ‘RTE_ACL_NODE_INDEX’
   RTE_ACL_NODE_INDEX,
   ^~~~~~~~~~~~~~~~~~
/home-local/jenkins-local/jenkins-agent/workspace/Apply-Custom-Patch-Set/dpdk/lib/librte_acl/acl_run.h:22:28: note: (near initialization for ‘zmm_index_mask’)
 #define RTE_ACL_NODE_INDEX ((uint32_t)~RTE_ACL_NODE_TYPE)
                            ^
/home-local/jenkins-local/jenkins-agent/workspace/Apply-Custom-Patch-Set/dpdk/lib/librte_acl/acl_run_avx512x16.h:44:3: note: in expansion of macro ‘RTE_ACL_NODE_INDEX’
   RTE_ACL_NODE_INDEX,
   ^~~~~~~~~~~~~~~~~~
/home-local/jenkins-local/jenkins-agent/workspace/Apply-Custom-Patch-Set/dpdk/lib/librte_acl/acl_run.h:22:28: error: excess elements in scalar initializer [-Werror]
 #define RTE_ACL_NODE_INDEX ((uint32_t)~RTE_ACL_NODE_TYPE)
                            ^
/home-local/jenkins-local/jenkins-agent/workspace/Apply-Custom-Patch-Set/dpdk/lib/librte_acl/acl_run_avx512x16.h:45:3: note: in expansion of macro ‘RTE_ACL_NODE_INDEX’
   RTE_ACL_NODE_INDEX,
   ^~~~~~~~~~~~~~~~~~
/home-local/jenkins-local/jenkins-agent/workspace/Apply-Custom-Patch-Set/dpdk/lib/librte_acl/acl_run.h:22:28: note: (near initialization for ‘zmm_index_mask’)
 #define RTE_ACL_NODE_INDEX ((uint32_t)~RTE_ACL_NODE_TYPE)
                            ^
/home-local/jenkins-local/jenkins-agent/workspace/Apply-Custom-Patch-Set/dpdk/lib/librte_acl/acl_run_avx512x16.h:45:3: note: in expansion of macro ‘RTE_ACL_NODE_INDEX’
   RTE_ACL_NODE_INDEX,
   ^~~~~~~~~~~~~~~~~~
/home-local/jenkins-local/jenkins-agent/workspace/Apply-Custom-Patch-Set/dpdk/lib/librte_acl/acl_run.h:22:28: error: excess elements in scalar initializer [-Werror]
 #define RTE_ACL_NODE_INDEX ((uint32_t)~RTE_ACL_NODE_TYPE)
                            ^
/home-local/jenkins-local/jenkins-agent/workspace/Apply-Custom-Patch-Set/dpdk/lib/librte_acl/acl_run_avx512x16.h:46:3: note: in expansion of macro ‘RTE_ACL_NODE_INDEX’
   RTE_ACL_NODE_INDEX,
   ^~~~~~~~~~~~~~~~~~
/home-local/jenkins-local/jenkins-agent/workspace/Apply-Custom-Patch-Set/dpdk/lib/librte_acl/acl_run.h:22:28: note: (near initialization for ‘zmm_index_mask’)
 #define RTE_ACL_NODE_INDEX ((uint32_t)~RTE_ACL_NODE_TYPE)
                            ^
/home-local/jenkins-local/jenkins-agent/workspace/Apply-Custom-Patch-Set/dpdk/lib/librte_acl/acl_run_avx512x16.h:46:3: note: in expansion of macro ‘RTE_ACL_NODE_INDEX’
   RTE_ACL_NODE_INDEX,
   ^~~~~~~~~~~~~~~~~~
/home-local/jenkins-local/jenkins-agent/workspace/Apply-Custom-Patch-Set/dpdk/lib/librte_acl/acl_run.h:22:28: error: excess elements in scalar initializer [-Werror]
 #define RTE_ACL_NODE_INDEX ((uint32_t)~RTE_ACL_NODE_TYPE)
                            ^
/home-local/jenkins-local/jenkins-agent/workspace/Apply-Custom-Patch-Set/dpdk/lib/librte_acl/acl_run_avx512x16.h:47:3: note: in expansion of macro ‘RTE_ACL_NODE_INDEX’
   RTE_ACL_NODE_INDEX,
   ^~~~~~~~~~~~~~~~~~
/home-local/jenkins-local/jenkins-agent/workspace/Apply-Custom-Patch-Set/dpdk/lib/librte_acl/acl_run.h:22:28: note: (near initialization for ‘zmm_index_mask’)
 #define RTE_ACL_NODE_INDEX ((uint32_t)~RTE_ACL_NODE_TYPE)
                            ^
/home-local/jenkins-local/jenkins-agent/workspace/Apply-Custom-Patch-Set/dpdk/lib/librte_acl/acl_run_avx512x16.h:47:3: note: in expansion of macro ‘RTE_ACL_NODE_INDEX’
   RTE_ACL_NODE_INDEX,
   ^~~~~~~~~~~~~~~~~~
/home-local/jenkins-local/jenkins-agent/workspace/Apply-Custom-Patch-Set/dpdk/lib/librte_acl/acl_run.h:22:28: error: excess elements in scalar initializer [-Werror]
 #define RTE_ACL_NODE_INDEX ((uint32_t)~RTE_ACL_NODE_TYPE)
                            ^
/home-local/jenkins-local/jenkins-agent/workspace/Apply-Custom-Patch-Set/dpdk/lib/librte_acl/acl_run_avx512x16.h:48:3: note: in expansion of macro ‘RTE_ACL_NODE_INDEX’
   RTE_ACL_NODE_INDEX,
   ^~~~~~~~~~~~~~~~~~
/home-local/jenkins-local/jenkins-agent/workspace/Apply-Custom-Patch-Set/dpdk/lib/librte_acl/acl_run.h:22:28: note: (near initialization for ‘zmm_index_mask’)
 #define RTE_ACL_NODE_INDEX ((uint32_t)~RTE_ACL_NODE_TYPE)
                            ^
/home-local/jenkins-local/jenkins-agent/workspace/Apply-Custom-Patch-Set/dpdk/lib/librte_acl/acl_run_avx512x16.h:48:3: note: in expansion of macro ‘RTE_ACL_NODE_INDEX’
   RTE_ACL_NODE_INDEX,
   ^~~~~~~~~~~~~~~~~~
In file included from /home-local/jenkins-local/jenkins-agent/workspace/Apply-Custom-Patch-Set/dpdk/lib/librte_acl/acl_run_avx512.c:124:0:
/home-local/jenkins-local/jenkins-agent/workspace/Apply-Custom-Patch-Set/dpdk/lib/librte_acl/acl_run_avx512x16.h:52:14: error: unknown type name ‘__rte_x86_zmm_t’
 static const __rte_x86_zmm_t zmm_trlo_idle = {
              ^~~~~~~~~~~~~~~
/home-local/jenkins-local/jenkins-agent/workspace/Apply-Custom-Patch-Set/dpdk/lib/librte_acl/acl_run_avx512x16.h:53:2: error: field name not in record or union initializer
  .u32 = {
  ^
/home-local/jenkins-local/jenkins-agent/workspace/Apply-Custom-Patch-Set/dpdk/lib/librte_acl/acl_run_avx512x16.h:53:2: note: (near initialization for ‘zmm_trlo_idle’)
/home-local/jenkins-local/jenkins-agent/workspace/Apply-Custom-Patch-Set/dpdk/lib/librte_acl/acl_run_avx512x16.h:53:2: error: braces around scalar initializer [-Werror]
/home-local/jenkins-local/jenkins-agent/workspace/Apply-Custom-Patch-Set/dpdk/lib/librte_acl/acl_run_avx512x16.h:53:2: note: (near initialization for ‘zmm_trlo_idle’)
In file included from /home-local/jenkins-local/jenkins-agent/workspace/Apply-Custom-Patch-Set/dpdk/lib/librte_acl/acl_run.h:9:0,
                 from /home-local/jenkins-local/jenkins-agent/workspace/Apply-Custom-Patch-Set/dpdk/lib/librte_acl/acl_run_sse.h:5,
                 from /home-local/jenkins-local/jenkins-agent/workspace/Apply-Custom-Patch-Set/dpdk/lib/librte_acl/acl_run_avx512.c:5:
/home-local/jenkins-local/jenkins-agent/workspace/Apply-Custom-Patch-Set/dpdk/lib/librte_acl/acl.h:19:26: error: excess elements in scalar initializer [-Werror]
 #define RTE_ACL_DFA_SIZE (UINT8_MAX + 1)
                          ^
/home-local/jenkins-local/jenkins-agent/workspace/Apply-Custom-Patch-Set/dpdk/lib/librte_acl/acl_run_avx512x16.h:55:3: note: in expansion of macro ‘RTE_ACL_DFA_SIZE’
   RTE_ACL_DFA_SIZE | RTE_ACL_NODE_SINGLE,
   ^~~~~~~~~~~~~~~~
/home-local/jenkins-local/jenkins-agent/workspace/Apply-Custom-Patch-Set/dpdk/lib/librte_acl/acl.h:19:26: note: (near initialization for ‘zmm_trlo_idle’)
 #define RTE_ACL_DFA_SIZE (UINT8_MAX + 1)
                          ^
/home-local/jenkins-local/jenkins-agent/workspace/Apply-Custom-Patch-Set/dpdk/lib/librte_acl/acl_run_avx512x16.h:55:3: note: in expansion of macro ‘RTE_ACL_DFA_SIZE’
   RTE_ACL_DFA_SIZE | RTE_ACL_NODE_SINGLE,
   ^~~~~~~~~~~~~~~~
/home-local/jenkins-local/jenkins-agent/workspace/Apply-Custom-Patch-Set/dpdk/lib/librte_acl/acl.h:19:26: error: excess elements in scalar initializer [-Werror]
 #define RTE_ACL_DFA_SIZE (UINT8_MAX + 1)
                          ^
/home-local/jenkins-local/jenkins-agent/workspace/Apply-Custom-Patch-Set/dpdk/lib/librte_acl/acl_run_avx512x16.h:56:3: note: in expansion of macro ‘RTE_ACL_DFA_SIZE’
   RTE_ACL_DFA_SIZE | RTE_ACL_NODE_SINGLE,
   ^~~~~~~~~~~~~~~~
/home-local/jenkins-local/jenkins-agent/workspace/Apply-Custom-Patch-Set/dpdk/lib/librte_acl/acl.h:19:26: note: (near initialization for ‘zmm_trlo_idle’)
 #define RTE_ACL_DFA_SIZE (UINT8_MAX + 1)
                          ^
/home-local/jenkins-local/jenkins-agent/workspace/Apply-Custom-Patch-Set/dpdk/lib/librte_acl/acl_run_avx512x16.h:56:3: note: in expansion of macro ‘RTE_ACL_DFA_SIZE’
   RTE_ACL_DFA_SIZE | RTE_ACL_NODE_SINGLE,
   ^~~~~~~~~~~~~~~~
/home-local/jenkins-local/jenkins-agent/workspace/Apply-Custom-Patch-Set/dpdk/lib/librte_acl/acl.h:19:26: error: excess elements in scalar initializer [-Werror]
 #define RTE_ACL_DFA_SIZE (UINT8_MAX + 1)
                          ^
/home-local/jenkins-local/jenkins-agent/workspace/Apply-Custom-Patch-Set/dpdk/lib/librte_acl/acl_run_avx512x16.h:57:3: note: in expansion of macro ‘RTE_ACL_DFA_SIZE’
   RTE_ACL_DFA_SIZE | RTE_ACL_NODE_SINGLE,
   ^~~~~~~~~~~~~~~~
/home-local/jenkins-local/jenkins-agent/workspace/Apply-Custom-Patch-Set/dpdk/lib/librte_acl/acl.h:19:26: note: (near initialization for ‘zmm_trlo_idle’)
 #define RTE_ACL_DFA_SIZE (UINT8_MAX + 1)
                          ^
/home-local/jenkins-local/jenkins-agent/workspace/Apply-Custom-Patch-Set/dpdk/lib/librte_acl/acl_run_avx512x16.h:57:3: note: in expansion of macro ‘RTE_ACL_DFA_SIZE’
   RTE_ACL_DFA_SIZE | RTE_ACL_NODE_SINGLE,
   ^~~~~~~~~~~~~~~~
/home-local/jenkins-local/jenkins-agent/workspace/Apply-Custom-Patch-Set/dpdk/lib/librte_acl/acl.h:19:26: error: excess elements in scalar initializer [-Werror]
 #define RTE_ACL_DFA_SIZE (UINT8_MAX + 1)
                          ^
/home-local/jenkins-local/jenkins-agent/workspace/Apply-Custom-Patch-Set/dpdk/lib/librte_acl/acl_run_avx512x16.h:58:3: note: in expansion of macro ‘RTE_ACL_DFA_SIZE’
   RTE_ACL_DFA_SIZE | RTE_ACL_NODE_SINGLE,
   ^~~~~~~~~~~~~~~~
/home-local/jenkins-local/jenkins-agent/workspace/Apply-Custom-Patch-Set/dpdk/lib/librte_acl/acl.h:19:26: note: (near initialization for ‘zmm_trlo_idle’)
 #define RTE_ACL_DFA_SIZE (UINT8_MAX + 1)
                          ^
/home-local/jenkins-local/jenkins-agent/workspace/Apply-Custom-Patch-Set/dpdk/lib/librte_acl/acl_run_avx512x16.h:58:3: note: in expansion of macro ‘RTE_ACL_DFA_SIZE’
   RTE_ACL_DFA_SIZE | RTE_ACL_NODE_SINGLE,
   ^~~~~~~~~~~~~~~~
/home-local/jenkins-local/jenkins-agent/workspace/Apply-Custom-Patch-Set/dpdk/lib/librte_acl/acl.h:19:26: error: excess elements in scalar initializer [-Werror]
 #define RTE_ACL_DFA_SIZE (UINT8_MAX + 1)
                          ^
/home-local/jenkins-local/jenkins-agent/workspace/Apply-Custom-Patch-Set/dpdk/lib/librte_acl/acl_run_avx512x16.h:59:3: note: in expansion of macro ‘RTE_ACL_DFA_SIZE’
   RTE_ACL_DFA_SIZE | RTE_ACL_NODE_SINGLE,
   ^~~~~~~~~~~~~~~~
/home-local/jenkins-local/jenkins-agent/workspace/Apply-Custom-Patch-Set/dpdk/lib/librte_acl/acl.h:19:26: note: (near initialization for ‘zmm_trlo_idle’)
 #define RTE_ACL_DFA_SIZE (UINT8_MAX + 1)
                          ^
/home-local/jenkins-local/jenkins-agent/workspace/Apply-Custom-Patch-Set/dpdk/lib/librte_acl/acl_run_avx512x16.h:59:3: note: in expansion of macro ‘RTE_ACL_DFA_SIZE’
   RTE_ACL_DFA_SIZE | RTE_ACL_NODE_SINGLE,
   ^~~~~~~~~~~~~~~~
/home-local/jenkins-local/jenkins-agent/workspace/Apply-Custom-Patch-Set/dpdk/lib/librte_acl/acl.h:19:26: error: excess elements in scalar initializer [-Werror]
 #define RTE_ACL_DFA_SIZE (UINT8_MAX + 1)
                          ^
/home-local/jenkins-local/jenkins-agent/workspace/Apply-Custom-Patch-Set/dpdk/lib/librte_acl/acl_run_avx512x16.h:60:3: note: in expansion of macro ‘RTE_ACL_DFA_SIZE’
   RTE_ACL_DFA_SIZE | RTE_ACL_NODE_SINGLE,
   ^~~~~~~~~~~~~~~~
/home-local/jenkins-local/jenkins-agent/workspace/Apply-Custom-Patch-Set/dpdk/lib/librte_acl/acl.h:19:26: note: (near initialization for ‘zmm_trlo_idle’)
 #define RTE_ACL_DFA_SIZE (UINT8_MAX + 1)
                          ^
/home-local/jenkins-local/jenkins-agent/workspace/Apply-Custom-Patch-Set/dpdk/lib/librte_acl/acl_run_avx512x16.h:60:3: note: in expansion of macro ‘RTE_ACL_DFA_SIZE’
   RTE_ACL_DFA_SIZE | RTE_ACL_NODE_SINGLE,
   ^~~~~~~~~~~~~~~~
/home-local/jenkins-local/jenkins-agent/workspace/Apply-Custom-Patch-Set/dpdk/lib/librte_acl/acl.h:19:26: error: excess elements in scalar initializer [-Werror]
 #define RTE_ACL_DFA_SIZE (UINT8_MAX + 1)
                          ^
/home-local/jenkins-local/jenkins-agent/workspace/Apply-Custom-Patch-Set/dpdk/lib/librte_acl/acl_run_avx512x16.h:61:3: note: in expansion of macro ‘RTE_ACL_DFA_SIZE’
   RTE_ACL_DFA_SIZE | RTE_ACL_NODE_SINGLE,
   ^~~~~~~~~~~~~~~~
/home-local/jenkins-local/jenkins-agent/workspace/Apply-Custom-Patch-Set/dpdk/lib/librte_acl/acl.h:19:26: note: (near initialization for ‘zmm_trlo_idle’)
 #define RTE_ACL_DFA_SIZE (UINT8_MAX + 1)
                          ^
/home-local/jenkins-local/jenkins-agent/workspace/Apply-Custom-Patch-Set/dpdk/lib/librte_acl/acl_run_avx512x16.h:61:3: note: in expansion of macro ‘RTE_ACL_DFA_SIZE’
   RTE_ACL_DFA_SIZE | RTE_ACL_NODE_SINGLE,
   ^~~~~~~~~~~~~~~~
/home-local/jenkins-local/jenkins-agent/workspace/Apply-Custom-Patch-Set/dpdk/lib/librte_acl/acl.h:19:26: error: excess elements in scalar initializer [-Werror]
 #define RTE_ACL_DFA_SIZE (UINT8_MAX + 1)
                          ^
/home-local/jenkins-local/jenkins-agent/workspace/Apply-Custom-Patch-Set/dpdk/lib/librte_acl/acl_run_avx512x16.h:62:3: note: in expansion of macro ‘RTE_ACL_DFA_SIZE’
   RTE_ACL_DFA_SIZE | RTE_ACL_NODE_SINGLE,
   ^~~~~~~~~~~~~~~~
/home-local/jenkins-local/jenkins-agent/workspace/Apply-Custom-Patch-Set/dpdk/lib/librte_acl/acl.h:19:26: note: (near initialization for ‘zmm_trlo_idle’)
 #define RTE_ACL_DFA_SIZE (UINT8_MAX + 1)
                          ^
/home-local/jenkins-local/jenkins-agent/workspace/Apply-Custom-Patch-Set/dpdk/lib/librte_acl/acl_run_avx512x16.h:62:3: note: in expansion of macro ‘RTE_ACL_DFA_SIZE’
   RTE_ACL_DFA_SIZE | RTE_ACL_NODE_SINGLE,
   ^~~~~~~~~~~~~~~~
/home-local/jenkins-local/jenkins-agent/workspace/Apply-Custom-Patch-Set/dpdk/lib/librte_acl/acl.h:19:26: error: excess elements in scalar initializer [-Werror]
 #define RTE_ACL_DFA_SIZE (UINT8_MAX + 1)
                          ^
/home-local/jenkins-local/jenkins-agent/workspace/Apply-Custom-Patch-Set/dpdk/lib/librte_acl/acl_run_avx512x16.h:63:3: note: in expansion of macro ‘RTE_ACL_DFA_SIZE’
   RTE_ACL_DFA_SIZE | RTE_ACL_NODE_SINGLE,
   ^~~~~~~~~~~~~~~~
/home-local/jenkins-local/jenkins-agent/workspace/Apply-Custom-Patch-Set/dpdk/lib/librte_acl/acl.h:19:26: note: (near initialization for ‘zmm_trlo_idle’)
 #define RTE_ACL_DFA_SIZE (UINT8_MAX + 1)
                          ^
/home-local/jenkins-local/jenkins-agent/workspace/Apply-Custom-Patch-Set/dpdk/lib/librte_acl/acl_run_avx512x16.h:63:3: note: in expansion of macro ‘RTE_ACL_DFA_SIZE’
   RTE_ACL_DFA_SIZE | RTE_ACL_NODE_SINGLE,
   ^~~~~~~~~~~~~~~~
/home-local/jenkins-local/jenkins-agent/workspace/Apply-Custom-Patch-Set/dpdk/lib/librte_acl/acl.h:19:26: error: excess elements in scalar initializer [-Werror]
 #define RTE_ACL_DFA_SIZE (UINT8_MAX + 1)
                          ^
/home-local/jenkins-local/jenkins-agent/workspace/Apply-Custom-Patch-Set/dpdk/lib/librte_acl/acl_run_avx512x16.h:64:3: note: in expansion of macro ‘RTE_ACL_DFA_SIZE’
   RTE_ACL_DFA_SIZE | RTE_ACL_NODE_SINGLE,
   ^~~~~~~~~~~~~~~~
/home-local/jenkins-local/jenkins-agent/workspace/Apply-Custom-Patch-Set/dpdk/lib/librte_acl/acl.h:19:26: note: (near initialization for ‘zmm_trlo_idle’)
 #define RTE_ACL_DFA_SIZE (UINT8_MAX + 1)
                          ^
/home-local/jenkins-local/jenkins-agent/workspace/Apply-Custom-Patch-Set/dpdk/lib/librte_acl/acl_run_avx512x16.h:64:3: note: in expansion of macro ‘RTE_ACL_DFA_SIZE’
   RTE_ACL_DFA_SIZE | RTE_ACL_NODE_SINGLE,
   ^~~~~~~~~~~~~~~~
/home-local/jenkins-local/jenkins-agent/workspace/Apply-Custom-Patch-Set/dpdk/lib/librte_acl/acl.h:19:26: error: excess elements in scalar initializer [-Werror]
 #define RTE_ACL_DFA_SIZE (UINT8_MAX + 1)
                          ^
/home-local/jenkins-local/jenkins-agent/workspace/Apply-Custom-Patch-Set/dpdk/lib/librte_acl/acl_run_avx512x16.h:65:3: note: in expansion of macro ‘RTE_ACL_DFA_SIZE’
   RTE_ACL_DFA_SIZE | RTE_ACL_NODE_SINGLE,
   ^~~~~~~~~~~~~~~~
/home-local/jenkins-local/jenkins-agent/workspace/Apply-Custom-Patch-Set/dpdk/lib/librte_acl/acl.h:19:26: note: (near initialization for ‘zmm_trlo_idle’)
 #define RTE_ACL_DFA_SIZE (UINT8_MAX + 1)
                          ^
/home-local/jenkins-local/jenkins-agent/workspace/Apply-Custom-Patch-Set/dpdk/lib/librte_acl/acl_run_avx512x16.h:65:3: note: in expansion of macro ‘RTE_ACL_DFA_SIZE’
   RTE_ACL_DFA_SIZE | RTE_ACL_NODE_SINGLE,
   ^~~~~~~~~~~~~~~~
/home-local/jenkins-local/jenkins-agent/workspace/Apply-Custom-Patch-Set/dpdk/lib/librte_acl/acl.h:19:26: error: excess elements in scalar initializer [-Werror]
 #define RTE_ACL_DFA_SIZE (UINT8_MAX + 1)
                          ^
/home-local/jenkins-local/jenkins-agent/workspace/Apply-Custom-Patch-Set/dpdk/lib/librte_acl/acl_run_avx512x16.h:66:3: note: in expansion of macro ‘RTE_ACL_DFA_SIZE’
   RTE_ACL_DFA_SIZE | RTE_ACL_NODE_SINGLE,
   ^~~~~~~~~~~~~~~~
/home-local/jenkins-local/jenkins-agent/workspace/Apply-Custom-Patch-Set/dpdk/lib/librte_acl/acl.h:19:26: note: (near initialization for ‘zmm_trlo_idle’)
 #define RTE_ACL_DFA_SIZE (UINT8_MAX + 1)
                          ^
/home-local/jenkins-local/jenkins-agent/workspace/Apply-Custom-Patch-Set/dpdk/lib/librte_acl/acl_run_avx512x16.h:66:3: note: in expansion of macro ‘RTE_ACL_DFA_SIZE’
   RTE_ACL_DFA_SIZE | RTE_ACL_NODE_SINGLE,
   ^~~~~~~~~~~~~~~~
/home-local/jenkins-local/jenkins-agent/workspace/Apply-Custom-Patch-Set/dpdk/lib/librte_acl/acl.h:19:26: error: excess elements in scalar initializer [-Werror]
 #define RTE_ACL_DFA_SIZE (UINT8_MAX + 1)
                          ^
/home-local/jenkins-local/jenkins-agent/workspace/Apply-Custom-Patch-Set/dpdk/lib/librte_acl/acl_run_avx512x16.h:67:3: note: in expansion of macro ‘RTE_ACL_DFA_SIZE’
   RTE_ACL_DFA_SIZE | RTE_ACL_NODE_SINGLE,
   ^~~~~~~~~~~~~~~~
/home-local/jenkins-local/jenkins-agent/workspace/Apply-Custom-Patch-Set/dpdk/lib/librte_acl/acl.h:19:26: note: (near initialization for ‘zmm_trlo_idle’)
 #define RTE_ACL_DFA_SIZE (UINT8_MAX + 1)
                          ^
/home-local/jenkins-local/jenkins-agent/workspace/Apply-Custom-Patch-Set/dpdk/lib/librte_acl/acl_run_avx512x16.h:67:3: note: in expansion of macro ‘RTE_ACL_DFA_SIZE’
   RTE_ACL_DFA_SIZE | RTE_ACL_NODE_SINGLE,
   ^~~~~~~~~~~~~~~~
/home-local/jenkins-local/jenkins-agent/workspace/Apply-Custom-Patch-Set/dpdk/lib/librte_acl/acl.h:19:26: error: excess elements in scalar initializer [-Werror]
 #define RTE_ACL_DFA_SIZE (UINT8_MAX + 1)
                          ^
/home-local/jenkins-local/jenkins-agent/workspace/Apply-Custom-Patch-Set/dpdk/lib/librte_acl/acl_run_avx512x16.h:68:3: note: in expansion of macro ‘RTE_ACL_DFA_SIZE’
   RTE_ACL_DFA_SIZE | RTE_ACL_NODE_SINGLE,
   ^~~~~~~~~~~~~~~~
/home-local/jenkins-local/jenkins-agent/workspace/Apply-Custom-Patch-Set/dpdk/lib/librte_acl/acl.h:19:26: note: (near initialization for ‘zmm_trlo_idle’)
 #define RTE_ACL_DFA_SIZE (UINT8_MAX + 1)
                          ^
/home-local/jenkins-local/jenkins-agent/workspace/Apply-Custom-Patch-Set/dpdk/lib/librte_acl/acl_run_avx512x16.h:68:3: note: in expansion of macro ‘RTE_ACL_DFA_SIZE’
   RTE_ACL_DFA_SIZE | RTE_ACL_NODE_SINGLE,
   ^~~~~~~~~~~~~~~~
/home-local/jenkins-local/jenkins-agent/workspace/Apply-Custom-Patch-Set/dpdk/lib/librte_acl/acl.h:19:26: error: excess elements in scalar initializer [-Werror]
 #define RTE_ACL_DFA_SIZE (UINT8_MAX + 1)
                          ^
/home-local/jenkins-local/jenkins-agent/workspace/Apply-Custom-Patch-Set/dpdk/lib/librte_acl/acl_run_avx512x16.h:69:3: note: in expansion of macro ‘RTE_ACL_DFA_SIZE’
   RTE_ACL_DFA_SIZE | RTE_ACL_NODE_SINGLE,
   ^~~~~~~~~~~~~~~~
/home-local/jenkins-local/jenkins-agent/workspace/Apply-Custom-Patch-Set/dpdk/lib/librte_acl/acl.h:19:26: note: (near initialization for ‘zmm_trlo_idle’)
 #define RTE_ACL_DFA_SIZE (UINT8_MAX + 1)
                          ^
/home-local/jenkins-local/jenkins-agent/workspace/Apply-Custom-Patch-Set/dpdk/lib/librte_acl/acl_run_avx512x16.h:69:3: note: in expansion of macro ‘RTE_ACL_DFA_SIZE’
   RTE_ACL_DFA_SIZE | RTE_ACL_NODE_SINGLE,
   ^~~~~~~~~~~~~~~~
In file included from /home-local/jenkins-local/jenkins-agent/workspace/Apply-Custom-Patch-Set/dpdk/lib/librte_acl/acl_run_avx512.c:124:0:
/home-local/jenkins-local/jenkins-agent/workspace/Apply-Custom-Patch-Set/dpdk/lib/librte_acl/acl_run_avx512x16.h:73:14: error: unknown type name ‘__rte_x86_zmm_t’
 static const __rte_x86_zmm_t zmm_trhi_idle = {
              ^~~~~~~~~~~~~~~
/home-local/jenkins-local/jenkins-agent/workspace/Apply-Custom-Patch-Set/dpdk/lib/librte_acl/acl_run_avx512x16.h:74:2: error: field name not in record or union initializer
  .u32 = {
  ^
/home-local/jenkins-local/jenkins-agent/workspace/Apply-Custom-Patch-Set/dpdk/lib/librte_acl/acl_run_avx512x16.h:74:2: note: (near initialization for ‘zmm_trhi_idle’)
/home-local/jenkins-local/jenkins-agent/workspace/Apply-Custom-Patch-Set/dpdk/lib/librte_acl/acl_run_avx512x16.h:74:2: error: braces around scalar initializer [-Werror]
/home-local/jenkins-local/jenkins-agent/workspace/Apply-Custom-Patch-Set/dpdk/lib/librte_acl/acl_run_avx512x16.h:74:2: note: (near initialization for ‘zmm_trhi_idle’)
/home-local/jenkins-local/jenkins-agent/workspace/Apply-Custom-Patch-Set/dpdk/lib/librte_acl/acl_run_avx512x16.h:75:6: error: excess elements in scalar initializer [-Werror]
   0, 0, 0, 0,
      ^
/home-local/jenkins-local/jenkins-agent/workspace/Apply-Custom-Patch-Set/dpdk/lib/librte_acl/acl_run_avx512x16.h:75:6: note: (near initialization for ‘zmm_trhi_idle’)
/home-local/jenkins-local/jenkins-agent/workspace/Apply-Custom-Patch-Set/dpdk/lib/librte_acl/acl_run_avx512x16.h:75:9: error: excess elements in scalar initializer [-Werror]
   0, 0, 0, 0,
         ^
/home-local/jenkins-local/jenkins-agent/workspace/Apply-Custom-Patch-Set/dpdk/lib/librte_acl/acl_run_avx512x16.h:75:9: note: (near initialization for ‘zmm_trhi_idle’)
/home-local/jenkins-local/jenkins-agent/workspace/Apply-Custom-Patch-Set/dpdk/lib/librte_acl/acl_run_avx512x16.h:75:12: error: excess elements in scalar initializer [-Werror]
   0, 0, 0, 0,
            ^
/home-local/jenkins-local/jenkins-agent/workspace/Apply-Custom-Patch-Set/dpdk/lib/librte_acl/acl_run_avx512x16.h:75:12: note: (near initialization for ‘zmm_trhi_idle’)
/home-local/jenkins-local/jenkins-agent/workspace/Apply-Custom-Patch-Set/dpdk/lib/librte_acl/acl_run_avx512x16.h:76:3: error: excess elements in scalar initializer [-Werror]
   0, 0, 0, 0,
   ^
/home-local/jenkins-local/jenkins-agent/workspace/Apply-Custom-Patch-Set/dpdk/lib/librte_acl/acl_run_avx512x16.h:76:3: note: (near initialization for ‘zmm_trhi_idle’)
/home-local/jenkins-local/jenkins-agent/workspace/Apply-Custom-Patch-Set/dpdk/lib/librte_acl/acl_run_avx512x16.h:76:6: error: excess elements in scalar initializer [-Werror]
   0, 0, 0, 0,
      ^
/home-local/jenkins-local/jenkins-agent/workspace/Apply-Custom-Patch-Set/dpdk/lib/librte_acl/acl_run_avx512x16.h:76:6: note: (near initialization for ‘zmm_trhi_idle’)
/home-local/jenkins-local/jenkins-agent/workspace/Apply-Custom-Patch-Set/dpdk/lib/librte_acl/acl_run_avx512x16.h:76:9: error: excess elements in scalar initializer [-Werror]
   0, 0, 0, 0,
         ^
/home-local/jenkins-local/jenkins-agent/workspace/Apply-Custom-Patch-Set/dpdk/lib/librte_acl/acl_run_avx512x16.h:76:9: note: (near initialization for ‘zmm_trhi_idle’)
/home-local/jenkins-local/jenkins-agent/workspace/Apply-Custom-Patch-Set/dpdk/lib/librte_acl/acl_run_avx512x16.h:76:12: error: excess elements in scalar initializer [-Werror]
   0, 0, 0, 0,
            ^
/home-local/jenkins-local/jenkins-agent/workspace/Apply-Custom-Patch-Set/dpdk/lib/librte_acl/acl_run_avx512x16.h:76:12: note: (near initialization for ‘zmm_trhi_idle’)
/home-local/jenkins-local/jenkins-agent/workspace/Apply-Custom-Patch-Set/dpdk/lib/librte_acl/acl_run_avx512x16.h:77:3: error: excess elements in scalar initializer [-Werror]
   0, 0, 0, 0,
   ^
/home-local/jenkins-local/jenkins-agent/workspace/Apply-Custom-Patch-Set/dpdk/lib/librte_acl/acl_run_avx512x16.h:77:3: note: (near initialization for ‘zmm_trhi_idle’)
/home-local/jenkins-local/jenkins-agent/workspace/Apply-Custom-Patch-Set/dpdk/lib/librte_acl/acl_run_avx512x16.h:77:6: error: excess elements in scalar initializer [-Werror]
   0, 0, 0, 0,
      ^
/home-local/jenkins-local/jenkins-agent/workspace/Apply-Custom-Patch-Set/dpdk/lib/librte_acl/acl_run_avx512x16.h:77:6: note: (near initialization for ‘zmm_trhi_idle’)
/home-local/jenkins-local/jenkins-agent/workspace/Apply-Custom-Patch-Set/dpdk/lib/librte_acl/acl_run_avx512x16.h:77:9: error: excess elements in scalar initializer [-Werror]
   0, 0, 0, 0,
         ^
/home-local/jenkins-local/jenkins-agent/workspace/Apply-Custom-Patch-Set/dpdk/lib/librte_acl/acl_run_avx512x16.h:77:9: note: (near initialization for ‘zmm_trhi_idle’)
/home-local/jenkins-local/jenkins-agent/workspace/Apply-Custom-Patch-Set/dpdk/lib/librte_acl/acl_run_avx512x16.h:77:12: error: excess elements in scalar initializer [-Werror]
   0, 0, 0, 0,
            ^
/home-local/jenkins-local/jenkins-agent/workspace/Apply-Custom-Patch-Set/dpdk/lib/librte_acl/acl_run_avx512x16.h:77:12: note: (near initialization for ‘zmm_trhi_idle’)
/home-local/jenkins-local/jenkins-agent/workspace/Apply-Custom-Patch-Set/dpdk/lib/librte_acl/acl_run_avx512x16.h:78:3: error: excess elements in scalar initializer [-Werror]
   0, 0, 0, 0,
   ^
/home-local/jenkins-local/jenkins-agent/workspace/Apply-Custom-Patch-Set/dpdk/lib/librte_acl/acl_run_avx512x16.h:78:3: note: (near initialization for ‘zmm_trhi_idle’)
/home-local/jenkins-local/jenkins-agent/workspace/Apply-Custom-Patch-Set/dpdk/lib/librte_acl/acl_run_avx512x16.h:78:6: error: excess elements in scalar initializer [-Werror]
   0, 0, 0, 0,
      ^
/home-local/jenkins-local/jenkins-agent/workspace/Apply-Custom-Patch-Set/dpdk/lib/librte_acl/acl_run_avx512x16.h:78:6: note: (near initialization for ‘zmm_trhi_idle’)
/home-local/jenkins-local/jenkins-agent/workspace/Apply-Custom-Patch-Set/dpdk/lib/librte_acl/acl_run_avx512x16.h:78:9: error: excess elements in scalar initializer [-Werror]
   0, 0, 0, 0,
         ^
/home-local/jenkins-local/jenkins-agent/workspace/Apply-Custom-Patch-Set/dpdk/lib/librte_acl/acl_run_avx512x16.h:78:9: note: (near initialization for ‘zmm_trhi_idle’)
/home-local/jenkins-local/jenkins-agent/workspace/Apply-Custom-Patch-Set/dpdk/lib/librte_acl/acl_run_avx512x16.h:78:12: error: excess elements in scalar initializer [-Werror]
   0, 0, 0, 0,
            ^
/home-local/jenkins-local/jenkins-agent/workspace/Apply-Custom-Patch-Set/dpdk/lib/librte_acl/acl_run_avx512x16.h:78:12: note: (near initialization for ‘zmm_trhi_idle’)
/home-local/jenkins-local/jenkins-agent/workspace/Apply-Custom-Patch-Set/dpdk/lib/librte_acl/acl_run_avx512x16.h:82:14: error: unknown type name ‘__rte_x86_zmm_t’
 static const __rte_x86_zmm_t zmm_shuffle_input = {
              ^~~~~~~~~~~~~~~
/home-local/jenkins-local/jenkins-agent/workspace/Apply-Custom-Patch-Set/dpdk/lib/librte_acl/acl_run_avx512x16.h:83:2: error: field name not in record or union initializer
  .u32 = {
  ^
/home-local/jenkins-local/jenkins-agent/workspace/Apply-Custom-Patch-Set/dpdk/lib/librte_acl/acl_run_avx512x16.h:83:2: note: (near initialization for ‘zmm_shuffle_input’)
/home-local/jenkins-local/jenkins-agent/workspace/Apply-Custom-Patch-Set/dpdk/lib/librte_acl/acl_run_avx512x16.h:83:2: error: braces around scalar initializer [-Werror]
/home-local/jenkins-local/jenkins-agent/workspace/Apply-Custom-Patch-Set/dpdk/lib/librte_acl/acl_run_avx512x16.h:83:2: note: (near initialization for ‘zmm_shuffle_input’)
/home-local/jenkins-local/jenkins-agent/workspace/Apply-Custom-Patch-Set/dpdk/lib/librte_acl/acl_run_avx512x16.h:84:15: error: excess elements in scalar initializer [-Werror]
   0x00000000, 0x04040404, 0x08080808, 0x0c0c0c0c,
               ^~~~~~~~~~
/home-local/jenkins-local/jenkins-agent/workspace/Apply-Custom-Patch-Set/dpdk/lib/librte_acl/acl_run_avx512x16.h:84:15: note: (near initialization for ‘zmm_shuffle_input’)
/home-local/jenkins-local/jenkins-agent/workspace/Apply-Custom-Patch-Set/dpdk/lib/librte_acl/acl_run_avx512x16.h:84:27: error: excess elements in scalar initializer [-Werror]
   0x00000000, 0x04040404, 0x08080808, 0x0c0c0c0c,
                           ^~~~~~~~~~
/home-local/jenkins-local/jenkins-agent/workspace/Apply-Custom-Patch-Set/dpdk/lib/librte_acl/acl_run_avx512x16.h:84:27: note: (near initialization for ‘zmm_shuffle_input’)
/home-local/jenkins-local/jenkins-agent/workspace/Apply-Custom-Patch-Set/dpdk/lib/librte_acl/acl_run_avx512x16.h:84:39: error: excess elements in scalar initializer [-Werror]
   0x00000000, 0x04040404, 0x08080808, 0x0c0c0c0c,
                                       ^~~~~~~~~~
/home-local/jenkins-local/jenkins-agent/workspace/Apply-Custom-Patch-Set/dpdk/lib/librte_acl/acl_run_avx512x16.h:84:39: note: (near initialization for ‘zmm_shuffle_input’)
/home-local/jenkins-local/jenkins-agent/workspace/Apply-Custom-Patch-Set/dpdk/lib/librte_acl/acl_run_avx512x16.h:85:3: error: excess elements in scalar initializer [-Werror]
   0x00000000, 0x04040404, 0x08080808, 0x0c0c0c0c,
   ^~~~~~~~~~
/home-local/jenkins-local/jenkins-agent/workspace/Apply-Custom-Patch-Set/dpdk/lib/librte_acl/acl_run_avx512x16.h:85:3: note: (near initialization for ‘zmm_shuffle_input’)
/home-local/jenkins-local/jenkins-agent/workspace/Apply-Custom-Patch-Set/dpdk/lib/librte_acl/acl_run_avx512x16.h:85:15: error: excess elements in scalar initializer [-Werror]
   0x00000000, 0x04040404, 0x08080808, 0x0c0c0c0c,
               ^~~~~~~~~~
/home-local/jenkins-local/jenkins-agent/workspace/Apply-Custom-Patch-Set/dpdk/lib/librte_acl/acl_run_avx512x16.h:85:15: note: (near initialization for ‘zmm_shuffle_input’)
/home-local/jenkins-local/jenkins-agent/workspace/Apply-Custom-Patch-Set/dpdk/lib/librte_acl/acl_run_avx512x16.h:85:27: error: excess elements in scalar initializer [-Werror]
   0x00000000, 0x04040404, 0x08080808, 0x0c0c0c0c,
                           ^~~~~~~~~~
/home-local/jenkins-local/jenkins-agent/workspace/Apply-Custom-Patch-Set/dpdk/lib/librte_acl/acl_run_avx512x16.h:85:27: note: (near initialization for ‘zmm_shuffle_input’)
/home-local/jenkins-local/jenkins-agent/workspace/Apply-Custom-Patch-Set/dpdk/lib/librte_acl/acl_run_avx512x16.h:85:39: error: excess elements in scalar initializer [-Werror]
   0x00000000, 0x04040404, 0x08080808, 0x0c0c0c0c,
                                       ^~~~~~~~~~
/home-local/jenkins-local/jenkins-agent/workspace/Apply-Custom-Patch-Set/dpdk/lib/librte_acl/acl_run_avx512x16.h:85:39: note: (near initialization for ‘zmm_shuffle_input’)
/home-local/jenkins-local/jenkins-agent/workspace/Apply-Custom-Patch-Set/dpdk/lib/librte_acl/acl_run_avx512x16.h:86:3: error: excess elements in scalar initializer [-Werror]
   0x00000000, 0x04040404, 0x08080808, 0x0c0c0c0c,
   ^~~~~~~~~~
/home-local/jenkins-local/jenkins-agent/workspace/Apply-Custom-Patch-Set/dpdk/lib/librte_acl/acl_run_avx512x16.h:86:3: note: (near initialization for ‘zmm_shuffle_input’)
/home-local/jenkins-local/jenkins-agent/workspace/Apply-Custom-Patch-Set/dpdk/lib/librte_acl/acl_run_avx512x16.h:86:15: error: excess elements in scalar initializer [-Werror]
   0x00000000, 0x04040404, 0x08080808, 0x0c0c0c0c,
               ^~~~~~~~~~
/home-local/jenkins-local/jenkins-agent/workspace/Apply-Custom-Patch-Set/dpdk/lib/librte_acl/acl_run_avx512x16.h:86:15: note: (near initialization for ‘zmm_shuffle_input’)
/home-local/jenkins-local/jenkins-agent/workspace/Apply-Custom-Patch-Set/dpdk/lib/librte_acl/acl_run_avx512x16.h:86:27: error: excess elements in scalar initializer [-Werror]
   0x00000000, 0x04040404, 0x08080808, 0x0c0c0c0c,
                           ^~~~~~~~~~
/home-local/jenkins-local/jenkins-agent/workspace/Apply-Custom-Patch-Set/dpdk/lib/librte_acl/acl_run_avx512x16.h:86:27: note: (near initialization for ‘zmm_shuffle_input’)
/home-local/jenkins-local/jenkins-agent/workspace/Apply-Custom-Patch-Set/dpdk/lib/librte_acl/acl_run_avx512x16.h:86:39: error: excess elements in scalar initializer [-Werror]
   0x00000000, 0x04040404, 0x08080808, 0x0c0c0c0c,
                                       ^~~~~~~~~~
/home-local/jenkins-local/jenkins-agent/workspace/Apply-Custom-Patch-Set/dpdk/lib/librte_acl/acl_run_avx512x16.h:86:39: note: (near initialization for ‘zmm_shuffle_input’)
/home-local/jenkins-local/jenkins-agent/workspace/Apply-Custom-Patch-Set/dpdk/lib/librte_acl/acl_run_avx512x16.h:87:3: error: excess elements in scalar initializer [-Werror]
   0x00000000, 0x04040404, 0x08080808, 0x0c0c0c0c,
   ^~~~~~~~~~
/home-local/jenkins-local/jenkins-agent/workspace/Apply-Custom-Patch-Set/dpdk/lib/librte_acl/acl_run_avx512x16.h:87:3: note: (near initialization for ‘zmm_shuffle_input’)
/home-local/jenkins-local/jenkins-agent/workspace/Apply-Custom-Patch-Set/dpdk/lib/librte_acl/acl_run_avx512x16.h:87:15: error: excess elements in scalar initializer [-Werror]
   0x00000000, 0x04040404, 0x08080808, 0x0c0c0c0c,
               ^~~~~~~~~~
/home-local/jenkins-local/jenkins-agent/workspace/Apply-Custom-Patch-Set/dpdk/lib/librte_acl/acl_run_avx512x16.h:87:15: note: (near initialization for ‘zmm_shuffle_input’)
/home-local/jenkins-local/jenkins-agent/workspace/Apply-Custom-Patch-Set/dpdk/lib/librte_acl/acl_run_avx512x16.h:87:27: error: excess elements in scalar initializer [-Werror]
   0x00000000, 0x04040404, 0x08080808, 0x0c0c0c0c,
                           ^~~~~~~~~~
/home-local/jenkins-local/jenkins-agent/workspace/Apply-Custom-Patch-Set/dpdk/lib/librte_acl/acl_run_avx512x16.h:87:27: note: (near initialization for ‘zmm_shuffle_input’)
/home-local/jenkins-local/jenkins-agent/workspace/Apply-Custom-Patch-Set/dpdk/lib/librte_acl/acl_run_avx512x16.h:87:39: error: excess elements in scalar initializer [-Werror]
   0x00000000, 0x04040404, 0x08080808, 0x0c0c0c0c,
                                       ^~~~~~~~~~
/home-local/jenkins-local/jenkins-agent/workspace/Apply-Custom-Patch-Set/dpdk/lib/librte_acl/acl_run_avx512x16.h:87:39: note: (near initialization for ‘zmm_shuffle_input’)
/home-local/jenkins-local/jenkins-agent/workspace/Apply-Custom-Patch-Set/dpdk/lib/librte_acl/acl_run_avx512x16.h:91:14: error: unknown type name ‘__rte_x86_zmm_t’
 static const __rte_x86_zmm_t zmm_four_32 = {
              ^~~~~~~~~~~~~~~
/home-local/jenkins-local/jenkins-agent/workspace/Apply-Custom-Patch-Set/dpdk/lib/librte_acl/acl_run_avx512x16.h:92:2: error: field name not in record or union initializer
  .u32 = {
  ^
/home-local/jenkins-local/jenkins-agent/workspace/Apply-Custom-Patch-Set/dpdk/lib/librte_acl/acl_run_avx512x16.h:92:2: note: (near initialization for ‘zmm_four_32’)
/home-local/jenkins-local/jenkins-agent/workspace/Apply-Custom-Patch-Set/dpdk/lib/librte_acl/acl_run_avx512x16.h:92:2: error: braces around scalar initializer [-Werror]
/home-local/jenkins-local/jenkins-agent/workspace/Apply-Custom-Patch-Set/dpdk/lib/librte_acl/acl_run_avx512x16.h:92:2: note: (near initialization for ‘zmm_four_32’)
/home-local/jenkins-local/jenkins-agent/workspace/Apply-Custom-Patch-Set/dpdk/lib/librte_acl/acl_run_avx512x16.h:93:6: error: excess elements in scalar initializer [-Werror]
   4, 4, 4, 4,
      ^
/home-local/jenkins-local/jenkins-agent/workspace/Apply-Custom-Patch-Set/dpdk/lib/librte_acl/acl_run_avx512x16.h:93:6: note: (near initialization for ‘zmm_four_32’)
/home-local/jenkins-local/jenkins-agent/workspace/Apply-Custom-Patch-Set/dpdk/lib/librte_acl/acl_run_avx512x16.h:93:9: error: excess elements in scalar initializer [-Werror]
   4, 4, 4, 4,
         ^
/home-local/jenkins-local/jenkins-agent/workspace/Apply-Custom-Patch-Set/dpdk/lib/librte_acl/acl_run_avx512x16.h:93:9: note: (near initialization for ‘zmm_four_32’)
/home-local/jenkins-local/jenkins-agent/workspace/Apply-Custom-Patch-Set/dpdk/lib/librte_acl/acl_run_avx512x16.h:93:12: error: excess elements in scalar initializer [-Werror]
   4, 4, 4, 4,
            ^
/home-local/jenkins-local/jenkins-agent/workspace/Apply-Custom-Patch-Set/dpdk/lib/librte_acl/acl_run_avx512x16.h:93:12: note: (near initialization for ‘zmm_four_32’)
/home-local/jenkins-local/jenkins-agent/workspace/Apply-Custom-Patch-Set/dpdk/lib/librte_acl/acl_run_avx512x16.h:94:3: error: excess elements in scalar initializer [-Werror]
   4, 4, 4, 4,
   ^
/home-local/jenkins-local/jenkins-agent/workspace/Apply-Custom-Patch-Set/dpdk/lib/librte_acl/acl_run_avx512x16.h:94:3: note: (near initialization for ‘zmm_four_32’)
/home-local/jenkins-local/jenkins-agent/workspace/Apply-Custom-Patch-Set/dpdk/lib/librte_acl/acl_run_avx512x16.h:94:6: error: excess elements in scalar initializer [-Werror]
   4, 4, 4, 4,
      ^
/home-local/jenkins-local/jenkins-agent/workspace/Apply-Custom-Patch-Set/dpdk/lib/librte_acl/acl_run_avx512x16.h:94:6: note: (near initialization for ‘zmm_four_32’)
/home-local/jenkins-local/jenkins-agent/workspace/Apply-Custom-Patch-Set/dpdk/lib/librte_acl/acl_run_avx512x16.h:94:9: error: excess elements in scalar initializer [-Werror]
   4, 4, 4, 4,
         ^
/home-local/jenkins-local/jenkins-agent/workspace/Apply-Custom-Patch-Set/dpdk/lib/librte_acl/acl_run_avx512x16.h:94:9: note: (near initialization for ‘zmm_four_32’)
/home-local/jenkins-local/jenkins-agent/workspace/Apply-Custom-Patch-Set/dpdk/lib/librte_acl/acl_run_avx512x16.h:94:12: error: excess elements in scalar initializer [-Werror]
   4, 4, 4, 4,
            ^
/home-local/jenkins-local/jenkins-agent/workspace/Apply-Custom-Patch-Set/dpdk/lib/librte_acl/acl_run_avx512x16.h:94:12: note: (near initialization for ‘zmm_four_32’)
/home-local/jenkins-local/jenkins-agent/workspace/Apply-Custom-Patch-Set/dpdk/lib/librte_acl/acl_run_avx512x16.h:95:3: error: excess elements in scalar initializer [-Werror]
   4, 4, 4, 4,
   ^
/home-local/jenkins-local/jenkins-agent/workspace/Apply-Custom-Patch-Set/dpdk/lib/librte_acl/acl_run_avx512x16.h:95:3: note: (near initialization for ‘zmm_four_32’)
/home-local/jenkins-local/jenkins-agent/workspace/Apply-Custom-Patch-Set/dpdk/lib/librte_acl/acl_run_avx512x16.h:95:6: error: excess elements in scalar initializer [-Werror]
   4, 4, 4, 4,
      ^
/home-local/jenkins-local/jenkins-agent/workspace/Apply-Custom-Patch-Set/dpdk/lib/librte_acl/acl_run_avx512x16.h:95:6: note: (near initialization for ‘zmm_four_32’)
/home-local/jenkins-local/jenkins-agent/workspace/Apply-Custom-Patch-Set/dpdk/lib/librte_acl/acl_run_avx512x16.h:95:9: error: excess elements in scalar initializer [-Werror]
   4, 4, 4, 4,
         ^
/home-local/jenkins-local/jenkins-agent/workspace/Apply-Custom-Patch-Set/dpdk/lib/librte_acl/acl_run_avx512x16.h:95:9: note: (near initialization for ‘zmm_four_32’)
/home-local/jenkins-local/jenkins-agent/workspace/Apply-Custom-Patch-Set/dpdk/lib/librte_acl/acl_run_avx512x16.h:95:12: error: excess elements in scalar initializer [-Werror]
   4, 4, 4, 4,
            ^
/home-local/jenkins-local/jenkins-agent/workspace/Apply-Custom-Patch-Set/dpdk/lib/librte_acl/acl_run_avx512x16.h:95:12: note: (near initialization for ‘zmm_four_32’)
/home-local/jenkins-local/jenkins-agent/workspace/Apply-Custom-Patch-Set/dpdk/lib/librte_acl/acl_run_avx512x16.h:96:3: error: excess elements in scalar initializer [-Werror]
   4, 4, 4, 4,
   ^
/home-local/jenkins-local/jenkins-agent/workspace/Apply-Custom-Patch-Set/dpdk/lib/librte_acl/acl_run_avx512x16.h:96:3: note: (near initialization for ‘zmm_four_32’)
/home-local/jenkins-local/jenkins-agent/workspace/Apply-Custom-Patch-Set/dpdk/lib/librte_acl/acl_run_avx512x16.h:96:6: error: excess elements in scalar initializer [-Werror]
   4, 4, 4, 4,
      ^
/home-local/jenkins-local/jenkins-agent/workspace/Apply-Custom-Patch-Set/dpdk/lib/librte_acl/acl_run_avx512x16.h:96:6: note: (near initialization for ‘zmm_four_32’)
/home-local/jenkins-local/jenkins-agent/workspace/Apply-Custom-Patch-Set/dpdk/lib/librte_acl/acl_run_avx512x16.h:96:9: error: excess elements in scalar initializer [-Werror]
   4, 4, 4, 4,
         ^
/home-local/jenkins-local/jenkins-agent/workspace/Apply-Custom-Patch-Set/dpdk/lib/librte_acl/acl_run_avx512x16.h:96:9: note: (near initialization for ‘zmm_four_32’)
/home-local/jenkins-local/jenkins-agent/workspace/Apply-Custom-Patch-Set/dpdk/lib/librte_acl/acl_run_avx512x16.h:96:12: error: excess elements in scalar initializer [-Werror]
   4, 4, 4, 4,
            ^
/home-local/jenkins-local/jenkins-agent/workspace/Apply-Custom-Patch-Set/dpdk/lib/librte_acl/acl_run_avx512x16.h:96:12: note: (near initialization for ‘zmm_four_32’)
/home-local/jenkins-local/jenkins-agent/workspace/Apply-Custom-Patch-Set/dpdk/lib/librte_acl/acl_run_avx512x16.h:100:14: error: unknown type name ‘__rte_x86_zmm_t’
 static const __rte_x86_zmm_t zmm_idx_add = {
              ^~~~~~~~~~~~~~~
/home-local/jenkins-local/jenkins-agent/workspace/Apply-Custom-Patch-Set/dpdk/lib/librte_acl/acl_run_avx512x16.h:101:2: error: field name not in record or union initializer
  .u32 = {
  ^
/home-local/jenkins-local/jenkins-agent/workspace/Apply-Custom-Patch-Set/dpdk/lib/librte_acl/acl_run_avx512x16.h:101:2: note: (near initialization for ‘zmm_idx_add’)
/home-local/jenkins-local/jenkins-agent/workspace/Apply-Custom-Patch-Set/dpdk/lib/librte_acl/acl_run_avx512x16.h:101:2: error: braces around scalar initializer [-Werror]
/home-local/jenkins-local/jenkins-agent/workspace/Apply-Custom-Patch-Set/dpdk/lib/librte_acl/acl_run_avx512x16.h:101:2: note: (near initialization for ‘zmm_idx_add’)
/home-local/jenkins-local/jenkins-agent/workspace/Apply-Custom-Patch-Set/dpdk/lib/librte_acl/acl_run_avx512x16.h:102:6: error: excess elements in scalar initializer [-Werror]
   0, 1, 2, 3,
      ^
/home-local/jenkins-local/jenkins-agent/workspace/Apply-Custom-Patch-Set/dpdk/lib/librte_acl/acl_run_avx512x16.h:102:6: note: (near initialization for ‘zmm_idx_add’)
/home-local/jenkins-local/jenkins-agent/workspace/Apply-Custom-Patch-Set/dpdk/lib/librte_acl/acl_run_avx512x16.h:102:9: error: excess elements in scalar initializer [-Werror]
   0, 1, 2, 3,
         ^
/home-local/jenkins-local/jenkins-agent/workspace/Apply-Custom-Patch-Set/dpdk/lib/librte_acl/acl_run_avx512x16.h:102:9: note: (near initialization for ‘zmm_idx_add’)
/home-local/jenkins-local/jenkins-agent/workspace/Apply-Custom-Patch-Set/dpdk/lib/librte_acl/acl_run_avx512x16.h:102:12: error: excess elements in scalar initializer [-Werror]
   0, 1, 2, 3,
            ^
/home-local/jenkins-local/jenkins-agent/workspace/Apply-Custom-Patch-Set/dpdk/lib/librte_acl/acl_run_avx512x16.h:102:12: note: (near initialization for ‘zmm_idx_add’)
/home-local/jenkins-local/jenkins-agent/workspace/Apply-Custom-Patch-Set/dpdk/lib/librte_acl/acl_run_avx512x16.h:103:3: error: excess elements in scalar initializer [-Werror]
   4, 5, 6, 7,
   ^
/home-local/jenkins-local/jenkins-agent/workspace/Apply-Custom-Patch-Set/dpdk/lib/librte_acl/acl_run_avx512x16.h:103:3: note: (near initialization for ‘zmm_idx_add’)
/home-local/jenkins-local/jenkins-agent/workspace/Apply-Custom-Patch-Set/dpdk/lib/librte_acl/acl_run_avx512x16.h:103:6: error: excess elements in scalar initializer [-Werror]
   4, 5, 6, 7,
      ^
/home-local/jenkins-local/jenkins-agent/workspace/Apply-Custom-Patch-Set/dpdk/lib/librte_acl/acl_run_avx512x16.h:103:6: note: (near initialization for ‘zmm_idx_add’)
/home-local/jenkins-local/jenkins-agent/workspace/Apply-Custom-Patch-Set/dpdk/lib/librte_acl/acl_run_avx512x16.h:103:9: error: excess elements in scalar initializer [-Werror]
   4, 5, 6, 7,
         ^
/home-local/jenkins-local/jenkins-agent/workspace/Apply-Custom-Patch-Set/dpdk/lib/librte_acl/acl_run_avx512x16.h:103:9: note: (near initialization for ‘zmm_idx_add’)
/home-local/jenkins-local/jenkins-agent/workspace/Apply-Custom-Patch-Set/dpdk/lib/librte_acl/acl_run_avx512x16.h:103:12: error: excess elements in scalar initializer [-Werror]
   4, 5, 6, 7,
            ^
/home-local/jenkins-local/jenkins-agent/workspace/Apply-Custom-Patch-Set/dpdk/lib/librte_acl/acl_run_avx512x16.h:103:12: note: (near initialization for ‘zmm_idx_add’)
/home-local/jenkins-local/jenkins-agent/workspace/Apply-Custom-Patch-Set/dpdk/lib/librte_acl/acl_run_avx512x16.h:104:3: error: excess elements in scalar initializer [-Werror]
   8, 9, 10, 11,
   ^
/home-local/jenkins-local/jenkins-agent/workspace/Apply-Custom-Patch-Set/dpdk/lib/librte_acl/acl_run_avx512x16.h:104:3: note: (near initialization for ‘zmm_idx_add’)
/home-local/jenkins-local/jenkins-agent/workspace/Apply-Custom-Patch-Set/dpdk/lib/librte_acl/acl_run_avx512x16.h:104:6: error: excess elements in scalar initializer [-Werror]
   8, 9, 10, 11,
      ^
/home-local/jenkins-local/jenkins-agent/workspace/Apply-Custom-Patch-Set/dpdk/lib/librte_acl/acl_run_avx512x16.h:104:6: note: (near initialization for ‘zmm_idx_add’)
/home-local/jenkins-local/jenkins-agent/workspace/Apply-Custom-Patch-Set/dpdk/lib/librte_acl/acl_run_avx512x16.h:104:9: error: excess elements in scalar initializer [-Werror]
   8, 9, 10, 11,
         ^~
/home-local/jenkins-local/jenkins-agent/workspace/Apply-Custom-Patch-Set/dpdk/lib/librte_acl/acl_run_avx512x16.h:104:9: note: (near initialization for ‘zmm_idx_add’)
/home-local/jenkins-local/jenkins-agent/workspace/Apply-Custom-Patch-Set/dpdk/lib/librte_acl/acl_run_avx512x16.h:104:13: error: excess elements in scalar initializer [-Werror]
   8, 9, 10, 11,
             ^~
/home-local/jenkins-local/jenkins-agent/workspace/Apply-Custom-Patch-Set/dpdk/lib/librte_acl/acl_run_avx512x16.h:104:13: note: (near initialization for ‘zmm_idx_add’)
/home-local/jenkins-local/jenkins-agent/workspace/Apply-Custom-Patch-Set/dpdk/lib/librte_acl/acl_run_avx512x16.h:105:3: error: excess elements in scalar initializer [-Werror]
   12, 13, 14, 15,
   ^~
/home-local/jenkins-local/jenkins-agent/workspace/Apply-Custom-Patch-Set/dpdk/lib/librte_acl/acl_run_avx512x16.h:105:3: note: (near initialization for ‘zmm_idx_add’)
/home-local/jenkins-local/jenkins-agent/workspace/Apply-Custom-Patch-Set/dpdk/lib/librte_acl/acl_run_avx512x16.h:105:7: error: excess elements in scalar initializer [-Werror]
   12, 13, 14, 15,
       ^~
/home-local/jenkins-local/jenkins-agent/workspace/Apply-Custom-Patch-Set/dpdk/lib/librte_acl/acl_run_avx512x16.h:105:7: note: (near initialization for ‘zmm_idx_add’)
/home-local/jenkins-local/jenkins-agent/workspace/Apply-Custom-Patch-Set/dpdk/lib/librte_acl/acl_run_avx512x16.h:105:11: error: excess elements in scalar initializer [-Werror]
   12, 13, 14, 15,
           ^~
/home-local/jenkins-local/jenkins-agent/workspace/Apply-Custom-Patch-Set/dpdk/lib/librte_acl/acl_run_avx512x16.h:105:11: note: (near initialization for ‘zmm_idx_add’)
/home-local/jenkins-local/jenkins-agent/workspace/Apply-Custom-Patch-Set/dpdk/lib/librte_acl/acl_run_avx512x16.h:105:15: error: excess elements in scalar initializer [-Werror]
   12, 13, 14, 15,
               ^~
/home-local/jenkins-local/jenkins-agent/workspace/Apply-Custom-Patch-Set/dpdk/lib/librte_acl/acl_run_avx512x16.h:105:15: note: (near initialization for ‘zmm_idx_add’)
/home-local/jenkins-local/jenkins-agent/workspace/Apply-Custom-Patch-Set/dpdk/lib/librte_acl/acl_run_avx512x16.h:109:14: error: unknown type name ‘__rte_x86_zmm_t’
 static const __rte_x86_zmm_t zmm_range_base = {
              ^~~~~~~~~~~~~~~
/home-local/jenkins-local/jenkins-agent/workspace/Apply-Custom-Patch-Set/dpdk/lib/librte_acl/acl_run_avx512x16.h:110:2: error: field name not in record or union initializer
  .u32 = {
  ^
/home-local/jenkins-local/jenkins-agent/workspace/Apply-Custom-Patch-Set/dpdk/lib/librte_acl/acl_run_avx512x16.h:110:2: note: (near initialization for ‘zmm_range_base’)
/home-local/jenkins-local/jenkins-agent/workspace/Apply-Custom-Patch-Set/dpdk/lib/librte_acl/acl_run_avx512x16.h:110:2: error: braces around scalar initializer [-Werror]
/home-local/jenkins-local/jenkins-agent/workspace/Apply-Custom-Patch-Set/dpdk/lib/librte_acl/acl_run_avx512x16.h:110:2: note: (near initialization for ‘zmm_range_base’)
/home-local/jenkins-local/jenkins-agent/workspace/Apply-Custom-Patch-Set/dpdk/lib/librte_acl/acl_run_avx512x16.h:111:15: error: excess elements in scalar initializer [-Werror]
   0xffffff00, 0xffffff04, 0xffffff08, 0xffffff0c,
               ^~~~~~~~~~
/home-local/jenkins-local/jenkins-agent/workspace/Apply-Custom-Patch-Set/dpdk/lib/librte_acl/acl_run_avx512x16.h:111:15: note: (near initialization for ‘zmm_range_base’)
/home-local/jenkins-local/jenkins-agent/workspace/Apply-Custom-Patch-Set/dpdk/lib/librte_acl/acl_run_avx512x16.h:111:27: error: excess elements in scalar initializer [-Werror]
   0xffffff00, 0xffffff04, 0xffffff08, 0xffffff0c,
                           ^~~~~~~~~~
/home-local/jenkins-local/jenkins-agent/workspace/Apply-Custom-Patch-Set/dpdk/lib/librte_acl/acl_run_avx512x16.h:111:27: note: (near initialization for ‘zmm_range_base’)
/home-local/jenkins-local/jenkins-agent/workspace/Apply-Custom-Patch-Set/dpdk/lib/librte_acl/acl_run_avx512x16.h:111:39: error: excess elements in scalar initializer [-Werror]
   0xffffff00, 0xffffff04, 0xffffff08, 0xffffff0c,
                                       ^~~~~~~~~~
/home-local/jenkins-local/jenkins-agent/workspace/Apply-Custom-Patch-Set/dpdk/lib/librte_acl/acl_run_avx512x16.h:111:39: note: (near initialization for ‘zmm_range_base’)
/home-local/jenkins-local/jenkins-agent/workspace/Apply-Custom-Patch-Set/dpdk/lib/librte_acl/acl_run_avx512x16.h:112:3: error: excess elements in scalar initializer [-Werror]
   0xffffff00, 0xffffff04, 0xffffff08, 0xffffff0c,
   ^~~~~~~~~~
/home-local/jenkins-local/jenkins-agent/workspace/Apply-Custom-Patch-Set/dpdk/lib/librte_acl/acl_run_avx512x16.h:112:3: note: (near initialization for ‘zmm_range_base’)
/home-local/jenkins-local/jenkins-agent/workspace/Apply-Custom-Patch-Set/dpdk/lib/librte_acl/acl_run_avx512x16.h:112:15: error: excess elements in scalar initializer [-Werror]
   0xffffff00, 0xffffff04, 0xffffff08, 0xffffff0c,
               ^~~~~~~~~~
/home-local/jenkins-local/jenkins-agent/workspace/Apply-Custom-Patch-Set/dpdk/lib/librte_acl/acl_run_avx512x16.h:112:15: note: (near initialization for ‘zmm_range_base’)
/home-local/jenkins-local/jenkins-agent/workspace/Apply-Custom-Patch-Set/dpdk/lib/librte_acl/acl_run_avx512x16.h:112:27: error: excess elements in scalar initializer [-Werror]
   0xffffff00, 0xffffff04, 0xffffff08, 0xffffff0c,
                           ^~~~~~~~~~
/home-local/jenkins-local/jenkins-agent/workspace/Apply-Custom-Patch-Set/dpdk/lib/librte_acl/acl_run_avx512x16.h:112:27: note: (near initialization for ‘zmm_range_base’)
/home-local/jenkins-local/jenkins-agent/workspace/Apply-Custom-Patch-Set/dpdk/lib/librte_acl/acl_run_avx512x16.h:112:39: error: excess elements in scalar initializer [-Werror]
   0xffffff00, 0xffffff04, 0xffffff08, 0xffffff0c,
                                       ^~~~~~~~~~
/home-local/jenkins-local/jenkins-agent/workspace/Apply-Custom-Patch-Set/dpdk/lib/librte_acl/acl_run_avx512x16.h:112:39: note: (near initialization for ‘zmm_range_base’)
/home-local/jenkins-local/jenkins-agent/workspace/Apply-Custom-Patch-Set/dpdk/lib/librte_acl/acl_run_avx512x16.h:113:3: error: excess elements in scalar initializer [-Werror]
   0xffffff00, 0xffffff04, 0xffffff08, 0xffffff0c,
   ^~~~~~~~~~
/home-local/jenkins-local/jenkins-agent/workspace/Apply-Custom-Patch-Set/dpdk/lib/librte_acl/acl_run_avx512x16.h:113:3: note: (near initialization for ‘zmm_range_base’)
/home-local/jenkins-local/jenkins-agent/workspace/Apply-Custom-Patch-Set/dpdk/lib/librte_acl/acl_run_avx512x16.h:113:15: error: excess elements in scalar initializer [-Werror]
   0xffffff00, 0xffffff04, 0xffffff08, 0xffffff0c,
               ^~~~~~~~~~
/home-local/jenkins-local/jenkins-agent/workspace/Apply-Custom-Patch-Set/dpdk/lib/librte_acl/acl_run_avx512x16.h:113:15: note: (near initialization for ‘zmm_range_base’)
/home-local/jenkins-local/jenkins-agent/workspace/Apply-Custom-Patch-Set/dpdk/lib/librte_acl/acl_run_avx512x16.h:113:27: error: excess elements in scalar initializer [-Werror]
   0xffffff00, 0xffffff04, 0xffffff08, 0xffffff0c,
                           ^~~~~~~~~~
/home-local/jenkins-local/jenkins-agent/workspace/Apply-Custom-Patch-Set/dpdk/lib/librte_acl/acl_run_avx512x16.h:113:27: note: (near initialization for ‘zmm_range_base’)
/home-local/jenkins-local/jenkins-agent/workspace/Apply-Custom-Patch-Set/dpdk/lib/librte_acl/acl_run_avx512x16.h:113:39: error: excess elements in scalar initializer [-Werror]
   0xffffff00, 0xffffff04, 0xffffff08, 0xffffff0c,
                                       ^~~~~~~~~~
/home-local/jenkins-local/jenkins-agent/workspace/Apply-Custom-Patch-Set/dpdk/lib/librte_acl/acl_run_avx512x16.h:113:39: note: (near initialization for ‘zmm_range_base’)
/home-local/jenkins-local/jenkins-agent/workspace/Apply-Custom-Patch-Set/dpdk/lib/librte_acl/acl_run_avx512x16.h:114:3: error: excess elements in scalar initializer [-Werror]
   0xffffff00, 0xffffff04, 0xffffff08, 0xffffff0c,
   ^~~~~~~~~~
/home-local/jenkins-local/jenkins-agent/workspace/Apply-Custom-Patch-Set/dpdk/lib/librte_acl/acl_run_avx512x16.h:114:3: note: (near initialization for ‘zmm_range_base’)
/home-local/jenkins-local/jenkins-agent/workspace/Apply-Custom-Patch-Set/dpdk/lib/librte_acl/acl_run_avx512x16.h:114:15: error: excess elements in scalar initializer [-Werror]
   0xffffff00, 0xffffff04, 0xffffff08, 0xffffff0c,
               ^~~~~~~~~~
/home-local/jenkins-local/jenkins-agent/workspace/Apply-Custom-Patch-Set/dpdk/lib/librte_acl/acl_run_avx512x16.h:114:15: note: (near initialization for ‘zmm_range_base’)
/home-local/jenkins-local/jenkins-agent/workspace/Apply-Custom-Patch-Set/dpdk/lib/librte_acl/acl_run_avx512x16.h:114:27: error: excess elements in scalar initializer [-Werror]
   0xffffff00, 0xffffff04, 0xffffff08, 0xffffff0c,
                           ^~~~~~~~~~
/home-local/jenkins-local/jenkins-agent/workspace/Apply-Custom-Patch-Set/dpdk/lib/librte_acl/acl_run_avx512x16.h:114:27: note: (near initialization for ‘zmm_range_base’)
/home-local/jenkins-local/jenkins-agent/workspace/Apply-Custom-Patch-Set/dpdk/lib/librte_acl/acl_run_avx512x16.h:114:39: error: excess elements in scalar initializer [-Werror]
   0xffffff00, 0xffffff04, 0xffffff08, 0xffffff0c,
                                       ^~~~~~~~~~
/home-local/jenkins-local/jenkins-agent/workspace/Apply-Custom-Patch-Set/dpdk/lib/librte_acl/acl_run_avx512x16.h:114:39: note: (near initialization for ‘zmm_range_base’)
/home-local/jenkins-local/jenkins-agent/workspace/Apply-Custom-Patch-Set/dpdk/lib/librte_acl/acl_run_avx512x16.h: In function ‘transition16’:
/home-local/jenkins-local/jenkins-agent/workspace/Apply-Custom-Patch-Set/dpdk/lib/librte_acl/acl_run_avx512x16.h:189:35: error: request for member ‘z’ in something not a structure or union
  addr = calc_addr16(zmm_index_mask.z, next_input, zmm_shuffle_input.z,
                                   ^
/home-local/jenkins-local/jenkins-agent/workspace/Apply-Custom-Patch-Set/dpdk/lib/librte_acl/acl_run_avx512x16.h:189:68: error: request for member ‘z’ in something not a structure or union
  addr = calc_addr16(zmm_index_mask.z, next_input, zmm_shuffle_input.z,
                                                                    ^
/home-local/jenkins-local/jenkins-agent/workspace/Apply-Custom-Patch-Set/dpdk/lib/librte_acl/acl_run_avx512x16.h:190:14: error: request for member ‘z’ in something not a structure or union
   zmm_four_32.z, zmm_range_base.z, *tr_lo, *tr_hi);
              ^
/home-local/jenkins-local/jenkins-agent/workspace/Apply-Custom-Patch-Set/dpdk/lib/librte_acl/acl_run_avx512x16.h:190:32: error: request for member ‘z’ in something not a structure or union
   zmm_four_32.z, zmm_range_base.z, *tr_lo, *tr_hi);
                                ^
/home-local/jenkins-local/jenkins-agent/workspace/Apply-Custom-Patch-Set/dpdk/lib/librte_acl/acl_run_avx512x16.h: In function ‘get_next_4bytes_avx512x16’:
/home-local/jenkins-local/jenkins-agent/workspace/Apply-Custom-Patch-Set/dpdk/lib/librte_acl/acl_run_avx512x16.h:235:15: error: unknown type name ‘__rte_x86_zmm_t’
  static const __rte_x86_zmm_t zmm_pminp = {
               ^~~~~~~~~~~~~~~
/home-local/jenkins-local/jenkins-agent/workspace/Apply-Custom-Patch-Set/dpdk/lib/librte_acl/acl_run_avx512x16.h:236:3: error: field name not in record or union initializer
   .u32 = {
   ^
/home-local/jenkins-local/jenkins-agent/workspace/Apply-Custom-Patch-Set/dpdk/lib/librte_acl/acl_run_avx512x16.h:236:3: note: (near initialization for ‘zmm_pminp’)
/home-local/jenkins-local/jenkins-agent/workspace/Apply-Custom-Patch-Set/dpdk/lib/librte_acl/acl_run_avx512x16.h:236:3: error: braces around scalar initializer [-Werror]
/home-local/jenkins-local/jenkins-agent/workspace/Apply-Custom-Patch-Set/dpdk/lib/librte_acl/acl_run_avx512x16.h:236:3: note: (near initialization for ‘zmm_pminp’)
/home-local/jenkins-local/jenkins-agent/workspace/Apply-Custom-Patch-Set/dpdk/lib/librte_acl/acl_run_avx512x16.h:237:10: error: excess elements in scalar initializer [-Werror]
    0x00, 0x01, 0x02, 0x03, 0x04, 0x05, 0x06, 0x07,
          ^~~~
/home-local/jenkins-local/jenkins-agent/workspace/Apply-Custom-Patch-Set/dpdk/lib/librte_acl/acl_run_avx512x16.h:237:10: note: (near initialization for ‘zmm_pminp’)
/home-local/jenkins-local/jenkins-agent/workspace/Apply-Custom-Patch-Set/dpdk/lib/librte_acl/acl_run_avx512x16.h:237:16: error: excess elements in scalar initializer [-Werror]
    0x00, 0x01, 0x02, 0x03, 0x04, 0x05, 0x06, 0x07,
                ^~~~
/home-local/jenkins-local/jenkins-agent/workspace/Apply-Custom-Patch-Set/dpdk/lib/librte_acl/acl_run_avx512x16.h:237:16: note: (near initialization for ‘zmm_pminp’)
/home-local/jenkins-local/jenkins-agent/workspace/Apply-Custom-Patch-Set/dpdk/lib/librte_acl/acl_run_avx512x16.h:237:22: error: excess elements in scalar initializer [-Werror]
    0x00, 0x01, 0x02, 0x03, 0x04, 0x05, 0x06, 0x07,
                      ^~~~
/home-local/jenkins-local/jenkins-agent/workspace/Apply-Custom-Patch-Set/dpdk/lib/librte_acl/acl_run_avx512x16.h:237:22: note: (near initialization for ‘zmm_pminp’)
/home-local/jenkins-local/jenkins-agent/workspace/Apply-Custom-Patch-Set/dpdk/lib/librte_acl/acl_run_avx512x16.h:237:28: error: excess elements in scalar initializer [-Werror]
    0x00, 0x01, 0x02, 0x03, 0x04, 0x05, 0x06, 0x07,
                            ^~~~
/home-local/jenkins-local/jenkins-agent/workspace/Apply-Custom-Patch-Set/dpdk/lib/librte_acl/acl_run_avx512x16.h:237:28: note: (near initialization for ‘zmm_pminp’)
/home-local/jenkins-local/jenkins-agent/workspace/Apply-Custom-Patch-Set/dpdk/lib/librte_acl/acl_run_avx512x16.h:237:34: error: excess elements in scalar initializer [-Werror]
    0x00, 0x01, 0x02, 0x03, 0x04, 0x05, 0x06, 0x07,
                                  ^~~~
/home-local/jenkins-local/jenkins-agent/workspace/Apply-Custom-Patch-Set/dpdk/lib/librte_acl/acl_run_avx512x16.h:237:34: note: (near initialization for ‘zmm_pminp’)
/home-local/jenkins-local/jenkins-agent/workspace/Apply-Custom-Patch-Set/dpdk/lib/librte_acl/acl_run_avx512x16.h:237:40: error: excess elements in scalar initializer [-Werror]
    0x00, 0x01, 0x02, 0x03, 0x04, 0x05, 0x06, 0x07,
                                        ^~~~
/home-local/jenkins-local/jenkins-agent/workspace/Apply-Custom-Patch-Set/dpdk/lib/librte_acl/acl_run_avx512x16.h:237:40: note: (near initialization for ‘zmm_pminp’)
/home-local/jenkins-local/jenkins-agent/workspace/Apply-Custom-Patch-Set/dpdk/lib/librte_acl/acl_run_avx512x16.h:237:46: error: excess elements in scalar initializer [-Werror]
    0x00, 0x01, 0x02, 0x03, 0x04, 0x05, 0x06, 0x07,
                                              ^~~~
/home-local/jenkins-local/jenkins-agent/workspace/Apply-Custom-Patch-Set/dpdk/lib/librte_acl/acl_run_avx512x16.h:237:46: note: (near initialization for ‘zmm_pminp’)
/home-local/jenkins-local/jenkins-agent/workspace/Apply-Custom-Patch-Set/dpdk/lib/librte_acl/acl_run_avx512x16.h:238:4: error: excess elements in scalar initializer [-Werror]
    0x10, 0x11, 0x12, 0x13, 0x14, 0x15, 0x16, 0x17,
    ^~~~
/home-local/jenkins-local/jenkins-agent/workspace/Apply-Custom-Patch-Set/dpdk/lib/librte_acl/acl_run_avx512x16.h:238:4: note: (near initialization for ‘zmm_pminp’)
/home-local/jenkins-local/jenkins-agent/workspace/Apply-Custom-Patch-Set/dpdk/lib/librte_acl/acl_run_avx512x16.h:238:10: error: excess elements in scalar initializer [-Werror]
    0x10, 0x11, 0x12, 0x13, 0x14, 0x15, 0x16, 0x17,
          ^~~~
/home-local/jenkins-local/jenkins-agent/workspace/Apply-Custom-Patch-Set/dpdk/lib/librte_acl/acl_run_avx512x16.h:238:10: note: (near initialization for ‘zmm_pminp’)
/home-local/jenkins-local/jenkins-agent/workspace/Apply-Custom-Patch-Set/dpdk/lib/librte_acl/acl_run_avx512x16.h:238:16: error: excess elements in scalar initializer [-Werror]
    0x10, 0x11, 0x12, 0x13, 0x14, 0x15, 0x16, 0x17,
                ^~~~
/home-local/jenkins-local/jenkins-agent/workspace/Apply-Custom-Patch-Set/dpdk/lib/librte_acl/acl_run_avx512x16.h:238:16: note: (near initialization for ‘zmm_pminp’)
/home-local/jenkins-local/jenkins-agent/workspace/Apply-Custom-Patch-Set/dpdk/lib/librte_acl/acl_run_avx512x16.h:238:22: error: excess elements in scalar initializer [-Werror]
    0x10, 0x11, 0x12, 0x13, 0x14, 0x15, 0x16, 0x17,
                      ^~~~
/home-local/jenkins-local/jenkins-agent/workspace/Apply-Custom-Patch-Set/dpdk/lib/librte_acl/acl_run_avx512x16.h:238:22: note: (near initialization for ‘zmm_pminp’)
/home-local/jenkins-local/jenkins-agent/workspace/Apply-Custom-Patch-Set/dpdk/lib/librte_acl/acl_run_avx512x16.h:238:28: error: excess elements in scalar initializer [-Werror]
    0x10, 0x11, 0x12, 0x13, 0x14, 0x15, 0x16, 0x17,
                            ^~~~
/home-local/jenkins-local/jenkins-agent/workspace/Apply-Custom-Patch-Set/dpdk/lib/librte_acl/acl_run_avx512x16.h:238:28: note: (near initialization for ‘zmm_pminp’)
/home-local/jenkins-local/jenkins-agent/workspace/Apply-Custom-Patch-Set/dpdk/lib/librte_acl/acl_run_avx512x16.h:238:34: error: excess elements in scalar initializer [-Werror]
    0x10, 0x11, 0x12, 0x13, 0x14, 0x15, 0x16, 0x17,
                                  ^~~~
/home-local/jenkins-local/jenkins-agent/workspace/Apply-Custom-Patch-Set/dpdk/lib/librte_acl/acl_run_avx512x16.h:238:34: note: (near initialization for ‘zmm_pminp’)
/home-local/jenkins-local/jenkins-agent/workspace/Apply-Custom-Patch-Set/dpdk/lib/librte_acl/acl_run_avx512x16.h:238:40: error: excess elements in scalar initializer [-Werror]
    0x10, 0x11, 0x12, 0x13, 0x14, 0x15, 0x16, 0x17,
                                        ^~~~
/home-local/jenkins-local/jenkins-agent/workspace/Apply-Custom-Patch-Set/dpdk/lib/librte_acl/acl_run_avx512x16.h:238:40: note: (near initialization for ‘zmm_pminp’)
/home-local/jenkins-local/jenkins-agent/workspace/Apply-Custom-Patch-Set/dpdk/lib/librte_acl/acl_run_avx512x16.h:238:46: error: excess elements in scalar initializer [-Werror]
    0x10, 0x11, 0x12, 0x13, 0x14, 0x15, 0x16, 0x17,
                                              ^~~~
/home-local/jenkins-local/jenkins-agent/workspace/Apply-Custom-Patch-Set/dpdk/lib/librte_acl/acl_run_avx512x16.h:238:46: note: (near initialization for ‘zmm_pminp’)
/home-local/jenkins-local/jenkins-agent/workspace/Apply-Custom-Patch-Set/dpdk/lib/librte_acl/acl_run_avx512x16.h:244:15: error: unknown type name ‘__rte_x86_zmm_t’
  static const __rte_x86_zmm_t zmm_pmidx[2] = {
               ^~~~~~~~~~~~~~~
/home-local/jenkins-local/jenkins-agent/workspace/Apply-Custom-Patch-Set/dpdk/lib/librte_acl/acl_run_avx512x16.h:245:3: error: braces around scalar initializer [-Werror]
   [0] = {
   ^
/home-local/jenkins-local/jenkins-agent/workspace/Apply-Custom-Patch-Set/dpdk/lib/librte_acl/acl_run_avx512x16.h:245:3: note: (near initialization for ‘zmm_pmidx[0]’)
/home-local/jenkins-local/jenkins-agent/workspace/Apply-Custom-Patch-Set/dpdk/lib/librte_acl/acl_run_avx512x16.h:246:4: error: field name not in record or union initializer
    .u32 = {
    ^
/home-local/jenkins-local/jenkins-agent/workspace/Apply-Custom-Patch-Set/dpdk/lib/librte_acl/acl_run_avx512x16.h:246:4: note: (near initialization for ‘zmm_pmidx[0]’)
/home-local/jenkins-local/jenkins-agent/workspace/Apply-Custom-Patch-Set/dpdk/lib/librte_acl/acl_run_avx512x16.h:246:4: error: braces around scalar initializer [-Werror]
/home-local/jenkins-local/jenkins-agent/workspace/Apply-Custom-Patch-Set/dpdk/lib/librte_acl/acl_run_avx512x16.h:246:4: note: (near initialization for ‘zmm_pmidx[0]’)
/home-local/jenkins-local/jenkins-agent/workspace/Apply-Custom-Patch-Set/dpdk/lib/librte_acl/acl_run_avx512x16.h:247:8: error: excess elements in scalar initializer [-Werror]
     0, 0, 1, 0, 2, 0, 3, 0,
        ^
/home-local/jenkins-local/jenkins-agent/workspace/Apply-Custom-Patch-Set/dpdk/lib/librte_acl/acl_run_avx512x16.h:247:8: note: (near initialization for ‘zmm_pmidx[0]’)
/home-local/jenkins-local/jenkins-agent/workspace/Apply-Custom-Patch-Set/dpdk/lib/librte_acl/acl_run_avx512x16.h:247:11: error: excess elements in scalar initializer [-Werror]
     0, 0, 1, 0, 2, 0, 3, 0,
           ^
/home-local/jenkins-local/jenkins-agent/workspace/Apply-Custom-Patch-Set/dpdk/lib/librte_acl/acl_run_avx512x16.h:247:11: note: (near initialization for ‘zmm_pmidx[0]’)
/home-local/jenkins-local/jenkins-agent/workspace/Apply-Custom-Patch-Set/dpdk/lib/librte_acl/acl_run_avx512x16.h:247:14: error: excess elements in scalar initializer [-Werror]
     0, 0, 1, 0, 2, 0, 3, 0,
              ^
/home-local/jenkins-local/jenkins-agent/workspace/Apply-Custom-Patch-Set/dpdk/lib/librte_acl/acl_run_avx512x16.h:247:14: note: (near initialization for ‘zmm_pmidx[0]’)
/home-local/jenkins-local/jenkins-agent/workspace/Apply-Custom-Patch-Set/dpdk/lib/librte_acl/acl_run_avx512x16.h:247:17: error: excess elements in scalar initializer [-Werror]
     0, 0, 1, 0, 2, 0, 3, 0,
                 ^
/home-local/jenkins-local/jenkins-agent/workspace/Apply-Custom-Patch-Set/dpdk/lib/librte_acl/acl_run_avx512x16.h:247:17: note: (near initialization for ‘zmm_pmidx[0]’)
/home-local/jenkins-local/jenkins-agent/workspace/Apply-Custom-Patch-Set/dpdk/lib/librte_acl/acl_run_avx512x16.h:247:20: error: excess elements in scalar initializer [-Werror]
     0, 0, 1, 0, 2, 0, 3, 0,
                    ^
/home-local/jenkins-local/jenkins-agent/workspace/Apply-Custom-Patch-Set/dpdk/lib/librte_acl/acl_run_avx512x16.h:247:20: note: (near initialization for ‘zmm_pmidx[0]’)
/home-local/jenkins-local/jenkins-agent/workspace/Apply-Custom-Patch-Set/dpdk/lib/librte_acl/acl_run_avx512x16.h:247:23: error: excess elements in scalar initializer [-Werror]
     0, 0, 1, 0, 2, 0, 3, 0,
                       ^
/home-local/jenkins-local/jenkins-agent/workspace/Apply-Custom-Patch-Set/dpdk/lib/librte_acl/acl_run_avx512x16.h:247:23: note: (near initialization for ‘zmm_pmidx[0]’)
/home-local/jenkins-local/jenkins-agent/workspace/Apply-Custom-Patch-Set/dpdk/lib/librte_acl/acl_run_avx512x16.h:247:26: error: excess elements in scalar initializer [-Werror]
     0, 0, 1, 0, 2, 0, 3, 0,
                          ^
/home-local/jenkins-local/jenkins-agent/workspace/Apply-Custom-Patch-Set/dpdk/lib/librte_acl/acl_run_avx512x16.h:247:26: note: (near initialization for ‘zmm_pmidx[0]’)
/home-local/jenkins-local/jenkins-agent/workspace/Apply-Custom-Patch-Set/dpdk/lib/librte_acl/acl_run_avx512x16.h:248:5: error: excess elements in scalar initializer [-Werror]
     4, 0, 5, 0, 6, 0, 7, 0,
     ^
/home-local/jenkins-local/jenkins-agent/workspace/Apply-Custom-Patch-Set/dpdk/lib/librte_acl/acl_run_avx512x16.h:248:5: note: (near initialization for ‘zmm_pmidx[0]’)
/home-local/jenkins-local/jenkins-agent/workspace/Apply-Custom-Patch-Set/dpdk/lib/librte_acl/acl_run_avx512x16.h:248:8: error: excess elements in scalar initializer [-Werror]
     4, 0, 5, 0, 6, 0, 7, 0,
        ^
/home-local/jenkins-local/jenkins-agent/workspace/Apply-Custom-Patch-Set/dpdk/lib/librte_acl/acl_run_avx512x16.h:248:8: note: (near initialization for ‘zmm_pmidx[0]’)
/home-local/jenkins-local/jenkins-agent/workspace/Apply-Custom-Patch-Set/dpdk/lib/librte_acl/acl_run_avx512x16.h:248:11: error: excess elements in scalar initializer [-Werror]
     4, 0, 5, 0, 6, 0, 7, 0,
           ^
/home-local/jenkins-local/jenkins-agent/workspace/Apply-Custom-Patch-Set/dpdk/lib/librte_acl/acl_run_avx512x16.h:248:11: note: (near initialization for ‘zmm_pmidx[0]’)
/home-local/jenkins-local/jenkins-agent/workspace/Apply-Custom-Patch-Set/dpdk/lib/librte_acl/acl_run_avx512x16.h:248:14: error: excess elements in scalar initializer [-Werror]
     4, 0, 5, 0, 6, 0, 7, 0,
              ^
/home-local/jenkins-local/jenkins-agent/workspace/Apply-Custom-Patch-Set/dpdk/lib/librte_acl/acl_run_avx512x16.h:248:14: note: (near initialization for ‘zmm_pmidx[0]’)
/home-local/jenkins-local/jenkins-agent/workspace/Apply-Custom-Patch-Set/dpdk/lib/librte_acl/acl_run_avx512x16.h:248:17: error: excess elements in scalar initializer [-Werror]
     4, 0, 5, 0, 6, 0, 7, 0,
                 ^
/home-local/jenkins-local/jenkins-agent/workspace/Apply-Custom-Patch-Set/dpdk/lib/librte_acl/acl_run_avx512x16.h:248:17: note: (near initialization for ‘zmm_pmidx[0]’)
/home-local/jenkins-local/jenkins-agent/workspace/Apply-Custom-Patch-Set/dpdk/lib/librte_acl/acl_run_avx512x16.h:248:20: error: excess elements in scalar initializer [-Werror]
     4, 0, 5, 0, 6, 0, 7, 0,
                    ^
/home-local/jenkins-local/jenkins-agent/workspace/Apply-Custom-Patch-Set/dpdk/lib/librte_acl/acl_run_avx512x16.h:248:20: note: (near initialization for ‘zmm_pmidx[0]’)
/home-local/jenkins-local/jenkins-agent/workspace/Apply-Custom-Patch-Set/dpdk/lib/librte_acl/acl_run_avx512x16.h:248:23: error: excess elements in scalar initializer [-Werror]
     4, 0, 5, 0, 6, 0, 7, 0,
                       ^
/home-local/jenkins-local/jenkins-agent/workspace/Apply-Custom-Patch-Set/dpdk/lib/librte_acl/acl_run_avx512x16.h:248:23: note: (near initialization for ‘zmm_pmidx[0]’)
/home-local/jenkins-local/jenkins-agent/workspace/Apply-Custom-Patch-Set/dpdk/lib/librte_acl/acl_run_avx512x16.h:248:26: error: excess elements in scalar initializer [-Werror]
     4, 0, 5, 0, 6, 0, 7, 0,
                          ^
/home-local/jenkins-local/jenkins-agent/workspace/Apply-Custom-Patch-Set/dpdk/lib/librte_acl/acl_run_avx512x16.h:248:26: note: (near initialization for ‘zmm_pmidx[0]’)
/home-local/jenkins-local/jenkins-agent/workspace/Apply-Custom-Patch-Set/dpdk/lib/librte_acl/acl_run_avx512x16.h:251:3: error: braces around scalar initializer [-Werror]
   [1] = {
   ^
/home-local/jenkins-local/jenkins-agent/workspace/Apply-Custom-Patch-Set/dpdk/lib/librte_acl/acl_run_avx512x16.h:251:3: note: (near initialization for ‘zmm_pmidx[1]’)
/home-local/jenkins-local/jenkins-agent/workspace/Apply-Custom-Patch-Set/dpdk/lib/librte_acl/acl_run_avx512x16.h:252:4: error: field name not in record or union initializer
    .u32 = {
    ^
/home-local/jenkins-local/jenkins-agent/workspace/Apply-Custom-Patch-Set/dpdk/lib/librte_acl/acl_run_avx512x16.h:252:4: note: (near initialization for ‘zmm_pmidx[1]’)
/home-local/jenkins-local/jenkins-agent/workspace/Apply-Custom-Patch-Set/dpdk/lib/librte_acl/acl_run_avx512x16.h:252:4: error: braces around scalar initializer [-Werror]
/home-local/jenkins-local/jenkins-agent/workspace/Apply-Custom-Patch-Set/dpdk/lib/librte_acl/acl_run_avx512x16.h:252:4: note: (near initialization for ‘zmm_pmidx[1]’)
/home-local/jenkins-local/jenkins-agent/workspace/Apply-Custom-Patch-Set/dpdk/lib/librte_acl/acl_run_avx512x16.h:253:8: error: excess elements in scalar initializer [-Werror]
     8, 0, 9, 0, 10, 0, 11, 0,
        ^
/home-local/jenkins-local/jenkins-agent/workspace/Apply-Custom-Patch-Set/dpdk/lib/librte_acl/acl_run_avx512x16.h:253:8: note: (near initialization for ‘zmm_pmidx[1]’)
/home-local/jenkins-local/jenkins-agent/workspace/Apply-Custom-Patch-Set/dpdk/lib/librte_acl/acl_run_avx512x16.h:253:11: error: excess elements in scalar initializer [-Werror]
     8, 0, 9, 0, 10, 0, 11, 0,
           ^
/home-local/jenkins-local/jenkins-agent/workspace/Apply-Custom-Patch-Set/dpdk/lib/librte_acl/acl_run_avx512x16.h:253:11: note: (near initialization for ‘zmm_pmidx[1]’)
/home-local/jenkins-local/jenkins-agent/workspace/Apply-Custom-Patch-Set/dpdk/lib/librte_acl/acl_run_avx512x16.h:253:14: error: excess elements in scalar initializer [-Werror]
     8, 0, 9, 0, 10, 0, 11, 0,
              ^
/home-local/jenkins-local/jenkins-agent/workspace/Apply-Custom-Patch-Set/dpdk/lib/librte_acl/acl_run_avx512x16.h:253:14: note: (near initialization for ‘zmm_pmidx[1]’)
/home-local/jenkins-local/jenkins-agent/workspace/Apply-Custom-Patch-Set/dpdk/lib/librte_acl/acl_run_avx512x16.h:253:17: error: excess elements in scalar initializer [-Werror]
     8, 0, 9, 0, 10, 0, 11, 0,
                 ^~
/home-local/jenkins-local/jenkins-agent/workspace/Apply-Custom-Patch-Set/dpdk/lib/librte_acl/acl_run_avx512x16.h:253:17: note: (near initialization for ‘zmm_pmidx[1]’)
/home-local/jenkins-local/jenkins-agent/workspace/Apply-Custom-Patch-Set/dpdk/lib/librte_acl/acl_run_avx512x16.h:253:21: error: excess elements in scalar initializer [-Werror]
     8, 0, 9, 0, 10, 0, 11, 0,
                     ^
/home-local/jenkins-local/jenkins-agent/workspace/Apply-Custom-Patch-Set/dpdk/lib/librte_acl/acl_run_avx512x16.h:253:21: note: (near initialization for ‘zmm_pmidx[1]’)
/home-local/jenkins-local/jenkins-agent/workspace/Apply-Custom-Patch-Set/dpdk/lib/librte_acl/acl_run_avx512x16.h:253:24: error: excess elements in scalar initializer [-Werror]
     8, 0, 9, 0, 10, 0, 11, 0,
                        ^~
/home-local/jenkins-local/jenkins-agent/workspace/Apply-Custom-Patch-Set/dpdk/lib/librte_acl/acl_run_avx512x16.h:253:24: note: (near initialization for ‘zmm_pmidx[1]’)
/home-local/jenkins-local/jenkins-agent/workspace/Apply-Custom-Patch-Set/dpdk/lib/librte_acl/acl_run_avx512x16.h:253:28: error: excess elements in scalar initializer [-Werror]
     8, 0, 9, 0, 10, 0, 11, 0,
                            ^
/home-local/jenkins-local/jenkins-agent/workspace/Apply-Custom-Patch-Set/dpdk/lib/librte_acl/acl_run_avx512x16.h:253:28: note: (near initialization for ‘zmm_pmidx[1]’)
/home-local/jenkins-local/jenkins-agent/workspace/Apply-Custom-Patch-Set/dpdk/lib/librte_acl/acl_run_avx512x16.h:254:5: error: excess elements in scalar initializer [-Werror]
     12, 0, 13, 0, 14, 0, 15, 0,
     ^~
/home-local/jenkins-local/jenkins-agent/workspace/Apply-Custom-Patch-Set/dpdk/lib/librte_acl/acl_run_avx512x16.h:254:5: note: (near initialization for ‘zmm_pmidx[1]’)
/home-local/jenkins-local/jenkins-agent/workspace/Apply-Custom-Patch-Set/dpdk/lib/librte_acl/acl_run_avx512x16.h:254:9: error: excess elements in scalar initializer [-Werror]
     12, 0, 13, 0, 14, 0, 15, 0,
         ^
/home-local/jenkins-local/jenkins-agent/workspace/Apply-Custom-Patch-Set/dpdk/lib/librte_acl/acl_run_avx512x16.h:254:9: note: (near initialization for ‘zmm_pmidx[1]’)
/home-local/jenkins-local/jenkins-agent/workspace/Apply-Custom-Patch-Set/dpdk/lib/librte_acl/acl_run_avx512x16.h:254:12: error: excess elements in scalar initializer [-Werror]
     12, 0, 13, 0, 14, 0, 15, 0,
            ^~
/home-local/jenkins-local/jenkins-agent/workspace/Apply-Custom-Patch-Set/dpdk/lib/librte_acl/acl_run_avx512x16.h:254:12: note: (near initialization for ‘zmm_pmidx[1]’)
/home-local/jenkins-local/jenkins-agent/workspace/Apply-Custom-Patch-Set/dpdk/lib/librte_acl/acl_run_avx512x16.h:254:16: error: excess elements in scalar initializer [-Werror]
     12, 0, 13, 0, 14, 0, 15, 0,
                ^
/home-local/jenkins-local/jenkins-agent/workspace/Apply-Custom-Patch-Set/dpdk/lib/librte_acl/acl_run_avx512x16.h:254:16: note: (near initialization for ‘zmm_pmidx[1]’)
/home-local/jenkins-local/jenkins-agent/workspace/Apply-Custom-Patch-Set/dpdk/lib/librte_acl/acl_run_avx512x16.h:254:19: error: excess elements in scalar initializer [-Werror]
     12, 0, 13, 0, 14, 0, 15, 0,
                   ^~
/home-local/jenkins-local/jenkins-agent/workspace/Apply-Custom-Patch-Set/dpdk/lib/librte_acl/acl_run_avx512x16.h:254:19: note: (near initialization for ‘zmm_pmidx[1]’)
/home-local/jenkins-local/jenkins-agent/workspace/Apply-Custom-Patch-Set/dpdk/lib/librte_acl/acl_run_avx512x16.h:254:23: error: excess elements in scalar initializer [-Werror]
     12, 0, 13, 0, 14, 0, 15, 0,
                       ^
/home-local/jenkins-local/jenkins-agent/workspace/Apply-Custom-Patch-Set/dpdk/lib/librte_acl/acl_run_avx512x16.h:254:23: note: (near initialization for ‘zmm_pmidx[1]’)
/home-local/jenkins-local/jenkins-agent/workspace/Apply-Custom-Patch-Set/dpdk/lib/librte_acl/acl_run_avx512x16.h:254:26: error: excess elements in scalar initializer [-Werror]
     12, 0, 13, 0, 14, 0, 15, 0,
                          ^~
/home-local/jenkins-local/jenkins-agent/workspace/Apply-Custom-Patch-Set/dpdk/lib/librte_acl/acl_run_avx512x16.h:254:26: note: (near initialization for ‘zmm_pmidx[1]’)
/home-local/jenkins-local/jenkins-agent/workspace/Apply-Custom-Patch-Set/dpdk/lib/librte_acl/acl_run_avx512x16.h:254:30: error: excess elements in scalar initializer [-Werror]
     12, 0, 13, 0, 14, 0, 15, 0,
                              ^
/home-local/jenkins-local/jenkins-agent/workspace/Apply-Custom-Patch-Set/dpdk/lib/librte_acl/acl_run_avx512x16.h:254:30: note: (near initialization for ‘zmm_pmidx[1]’)
/home-local/jenkins-local/jenkins-agent/workspace/Apply-Custom-Patch-Set/dpdk/lib/librte_acl/acl_run_avx512x16.h:268:63: error: request for member ‘z’ in something not a structure or union
  p[0] = _mm512_maskz_permutexvar_epi32(pmidx_msk, zmm_pmidx[0].z, t);
                                                               ^
/home-local/jenkins-local/jenkins-agent/workspace/Apply-Custom-Patch-Set/dpdk/lib/librte_acl/acl_run_avx512x16.h:269:63: error: request for member ‘z’ in something not a structure or union
  p[1] = _mm512_maskz_permutexvar_epi32(pmidx_msk, zmm_pmidx[1].z, t);
                                                               ^
/home-local/jenkins-local/jenkins-agent/workspace/Apply-Custom-Patch-Set/dpdk/lib/librte_acl/acl_run_avx512x16.h:280:13: error: request for member ‘z’ in something not a structure or union
    zmm_pminp.z, _mm512_castsi256_si512(inp[1]));
             ^
/home-local/jenkins-local/jenkins-agent/workspace/Apply-Custom-Patch-Set/dpdk/lib/librte_acl/acl_run_avx512x16.h:244:31: error: variable ‘zmm_pmidx’ set but not used [-Werror=unused-but-set-variable]
  static const __rte_x86_zmm_t zmm_pmidx[2] = {
                               ^~~~~~~~~
/home-local/jenkins-local/jenkins-agent/workspace/Apply-Custom-Patch-Set/dpdk/lib/librte_acl/acl_run_avx512x16.h:235:31: error: variable ‘zmm_pminp’ set but not used [-Werror=unused-but-set-variable]
  static const __rte_x86_zmm_t zmm_pminp = {
                               ^~~~~~~~~
/home-local/jenkins-local/jenkins-agent/workspace/Apply-Custom-Patch-Set/dpdk/lib/librte_acl/acl_run_avx512x16.h: In function ‘start_flow16’:
/home-local/jenkins-local/jenkins-agent/workspace/Apply-Custom-Patch-Set/dpdk/lib/librte_acl/acl_run_avx512x16.h:300:39: error: request for member ‘z’ in something not a structure or union
  ni = _mm512_add_epi32(ni, zmm_idx_add.z);
                                       ^
/home-local/jenkins-local/jenkins-agent/workspace/Apply-Custom-Patch-Set/dpdk/lib/librte_acl/acl_run_avx512x16.h: In function ‘match_process_avx512x16’:
/home-local/jenkins-local/jenkins-agent/workspace/Apply-Custom-Patch-Set/dpdk/lib/librte_acl/acl_run_avx512x16.h:350:49: error: request for member ‘z’ in something not a structure or union
  res = _mm512_and_si512(tr_lo[0], zmm_index_mask.z);
                                                 ^
/home-local/jenkins-local/jenkins-agent/workspace/Apply-Custom-Patch-Set/dpdk/lib/librte_acl/acl_run_avx512x16.h:353:67: error: request for member ‘z’ in something not a structure or union
  tr_lo[0] = _mm512_mask_mov_epi32(tr_lo[0], rmsk[0], zmm_trlo_idle.z);
                                                                   ^
/home-local/jenkins-local/jenkins-agent/workspace/Apply-Custom-Patch-Set/dpdk/lib/librte_acl/acl_run_avx512x16.h:354:67: error: request for member ‘z’ in something not a structure or union
  tr_hi[0] = _mm512_mask_mov_epi32(tr_hi[0], rmsk[0], zmm_trhi_idle.z);
                                                                   ^
/home-local/jenkins-local/jenkins-agent/workspace/Apply-Custom-Patch-Set/dpdk/lib/librte_acl/acl_run_avx512x16.h: In function ‘match_check_process_avx512x16x2’:
/home-local/jenkins-local/jenkins-agent/workspace/Apply-Custom-Patch-Set/dpdk/lib/librte_acl/acl_run_avx512x16.h:376:57: error: request for member ‘z’ in something not a structure or union
  rm[0] = _mm512_test_epi32_mask(tr_lo[0], zmm_match_mask.z);
                                                         ^
/home-local/jenkins-local/jenkins-agent/workspace/Apply-Custom-Patch-Set/dpdk/lib/librte_acl/acl_run_avx512x16.h:377:57: error: request for member ‘z’ in something not a structure or union
  rm[1] = _mm512_test_epi32_mask(tr_lo[1], zmm_match_mask.z);
                                                         ^
/home-local/jenkins-local/jenkins-agent/workspace/Apply-Custom-Patch-Set/dpdk/lib/librte_acl/acl_run_avx512x16.h:392:19: error: request for member ‘z’ in something not a structure or union
     zmm_match_mask.z);
                   ^
/home-local/jenkins-local/jenkins-agent/workspace/Apply-Custom-Patch-Set/dpdk/lib/librte_acl/acl_run_avx512x16.h:401:19: error: request for member ‘z’ in something not a structure or union
     zmm_match_mask.z);
                   ^
/home-local/jenkins-local/jenkins-agent/workspace/Apply-Custom-Patch-Set/dpdk/lib/librte_acl/acl_run_avx512x16.h: In function ‘get_next_4bytes_avx512x16’:
/home-local/jenkins-local/jenkins-agent/workspace/Apply-Custom-Patch-Set/dpdk/lib/librte_acl/acl_run_avx512x16.h:281:1: error: control reaches end of non-void function [-Werror=return-type]
 }
 ^
/home-local/jenkins-local/jenkins-agent/workspace/Apply-Custom-Patch-Set/dpdk/lib/librte_acl/acl_run_avx512.c: At top level:
cc1: error: unrecognized command line option ‘-Wno-address-of-packed-member’ [-Werror]
cc1: all warnings being treated as errors
/home-local/jenkins-local/jenkins-agent/workspace/Apply-Custom-Patch-Set/dpdk/mk/internal/rte.compile-pre.mk:114: recipe for target 'acl_run_avx512.o' failed
make[5]: *** [acl_run_avx512.o] Error 1
/home-local/jenkins-local/jenkins-agent/workspace/Apply-Custom-Patch-Set/dpdk/mk/rte.subdir.mk:35: recipe for target 'librte_acl' failed
make[4]: *** [librte_acl] Error 2
/home-local/jenkins-local/jenkins-agent/workspace/Apply-Custom-Patch-Set/dpdk/mk/rte.sdkbuild.mk:51: recipe for target 'lib' failed
make[3]: *** [lib] Error 2
/home-local/jenkins-local/jenkins-agent/workspace/Apply-Custom-Patch-Set/dpdk/mk/rte.sdkroot.mk:113: recipe for target 'all' failed
make[2]: *** [all] Error 2
/home-local/jenkins-local/jenkins-agent/workspace/Apply-Custom-Patch-Set/dpdk/mk/rte.sdkinstall.mk:60: recipe for target 'pre_install' failed
make[1]: *** [pre_install] Error 2
/home-local/jenkins-local/jenkins-agent/workspace/Apply-Custom-Patch-Set/dpdk/mk/rte.sdkroot.mk:92: recipe for target 'install' failed
make: *** [install] Error 2